ID,"Collection / Source","Catalog Number","Specify Number",Taxon,"Common Name",State,County,Date,Time,Locale,Latitude,Longitude,Collector,"Life Stage","Collection Method","Preparation Type",Count,Temperature,Humidity,"Dew Point",Wind,"Wind Direction","Barometric Pressure",Sky,"Moon Phase",Notes
68978,,2014-069585,,"Empoasca fabae","Potato Leafhopper",Iowa,Muscatine,2009-06-13,,"McKeown Bridge River Access",41.41028,-91.29139,"Moni Hayne",adult,,Sighting,1,,,,,,,,,
129061,,2015-019651,,"Empoasca fabae","Potato Leafhopper",Iowa,Scott,2015-07-18,,Walcott,41.59151,-90.781632,"Moni Hayne",adult,,Photograph,1,,,,,,,,,
147275,,2016-011902,,"Empoasca trifasciata",None,Iowa,Winneshiek,2012-07-05,,"100 Acre Wood-x",0,0,"MJ Hatfield",adult,,Photograph,1,,,,,,,,,
147314,,2016-011941,,"Empoasca fabae","Potato Leafhopper",Iowa,Winneshiek,2012-06-18,,"100 Acre Wood-x",0,0,"MJ Hatfield",adult,,Photograph,1,,,,,,,,,
170947,,2016-035692,,"Empoasca fabae","Potato Leafhopper",Iowa,Linn,2016-06-27,2100-2330,"Hitaga Sand Ridge Prairie Preserve",42.250957,-91.632098,"Jim Durbin",adult,Blacklight/Fluorescent,Photograph,1,77,59,62,4,300,30.06,"partly cloudy","50% visible",
171911,,2016-036656,,"Empoasca coccinea",None,Iowa,Linn,2016-07-14,2100-2330,"Hitaga Sand Ridge Prairie Preserve",42.250957,-91.632098,"Jim Durbin",adult,Blacklight/Fluorescent,Photograph,1,71,74,62,2,345,29.92,clear,"80% visible",
171972,,2016-036717,,"Empoasca coccinea",None,Iowa,Linn,2016-07-14,2100-2330,"Hitaga Sand Ridge Prairie Preserve",42.250957,-91.632098,"Jim Durbin",adult,Blacklight/Fluorescent,Photograph,1,71,74,62,2,345,29.92,clear,"80% visible",
172167,,2016-036912,,"Empoasca coccinea",None,Iowa,Linn,2016-07-20,2100-2330,"Hitaga Sand Ridge Prairie Preserve",42.250957,-91.632098,"Jim Durbin",adult,Blacklight/Fluorescent,Photograph,1,81,90,77,5,180,30.01,cloudy,full,
172564,,2016-037309,,"Empoasca fabae","Potato Leafhopper",Iowa,Linn,2016-07-24,,"Hitaga Sand Ridge Prairie Preserve",42.250957,-91.632098,"Jim Durbin",adult,Blacklight/Fluorescent,Photograph,1,77,70,66,,300,29.9,"partly cloudy","90% visible",
185049,,2017-003011,,"Empoasca fabae","Potato Leafhopper",Iowa,Scott,2016-07-30,,"Nahant Marsh Education Center",41.489953,-90.635216,"Moni Hayne",adult,,Photograph,1,,,,,,,,,
193502,,2017-011467,,"Empoasca coccinea",None,Iowa,Linn,2017-07-04,,"Wickiup Hill Outdoor Learning Area",42.087358,-91.767092,"Jim Durbin",adult,Blacklight/Fluorescent,Photograph,1,78,78,71,3,90,30.02,"partly cloudy","80% visible",
193503,,2017-011468,,"Empoasca coccinea",None,Iowa,Linn,2017-07-04,,"Wickiup Hill Outdoor Learning Area",42.087358,-91.767092,"Jim Durbin",adult,Blacklight/Fluorescent,Photograph,1,78,78,71,3,90,30.02,"partly cloudy","80% visible",
193510,,2017-011475,,"Empoasca coccinea",None,Iowa,Linn,2017-07-04,,"Wickiup Hill Outdoor Learning Area",42.087358,-91.767092,"Jim Durbin",adult,Blacklight/Fluorescent,Photograph,1,78,78,71,3,90,30.02,"partly cloudy","80% visible",
193516,,2017-011481,,"Empoasca coccinea",None,Iowa,Linn,2017-07-04,,"Wickiup Hill Outdoor Learning Area",42.087358,-91.767092,"Jim Durbin",adult,Blacklight/Fluorescent,Photograph,1,78,78,71,3,90,30.02,"partly cloudy","80% visible",
193517,,2017-011482,,"Empoasca fabae","Potato Leafhopper",Iowa,Linn,2017-07-04,,"Wickiup Hill Outdoor Learning Area",42.087358,-91.767092,"Jim Durbin",adult,Blacklight/Fluorescent,Photograph,1,78,78,71,3,90,30.02,"partly cloudy","80% visible",
193540,,2017-011505,,"Empoasca coccinea",None,Iowa,Linn,2017-07-04,2045-2330,"Wickiup Hill Outdoor Learning Area",42.087358,-91.767092,"Jim Durbin",adult,Blacklight/Fluorescent,Photograph,1,78,78,71,3,90,30.02,"partly cloudy","80% visible",
193823,,2017-011814,,"Empoasca fabae","Potato Leafhopper",Iowa,Linn,2017-07-15,,"1460 Douglas Ct, Marion",42.040069,-91.590953,"Jim Durbin",adult,Blacklight/Fluorescent,Photograph,1,,,,,,,,,
194449,,2017-012414,,"Empoasca coccinea",None,Iowa,Linn,2017-07-29,2045-2315,"Hitaga Sand Ridge Prairie Preserve",42.250957,-91.632098,"Jim Durbin",adult,Blacklight/Fluorescent,Photograph,1,69,73,61,0,0,30.09,clear,"40% visible",
194646,,2017-012610,,"Empoasca coccinea",None,Iowa,Linn,2017-08-01,2045-2300,"Matsell Bridge Natural Area",42.131126,-91.388999,"Jim Durbin",adult,Blacklight/Fluorescent,Photograph,1,83,91,57,5,210,30.03,cloudy,"50% visible",
194699,,2017-012663,,"Empoasca fabae","Potato Leafhopper",Iowa,Linn,2017-08-01,2045-2300,"Matsell Bridge Natural Area",42.131126,-91.388999,"Jim Durbin",adult,Blacklight/Fluorescent,Photograph,1,83,91,57,5,210,30.03,cloudy,"50% visible",
195398,,2017-013362,,"Empoasca fabae","Potato Leafhopper",Iowa,Linn,2017-08-14,2030-2300,"Hitaga Sand Ridge Prairie Preserve",42.250957,-91.632098,"Jim Durbin",adult,Blacklight/Fluorescent,Photograph,1,72,97,71,0,0,29.81,clear,"60% visible",
195658,,2017-013622,,"Empoasca fabae","Potato Leafhopper",Iowa,Linn,2017-08-18,2030-2300,"Wickiup Hill Outdoor Learning Area",42.087567,-91.767578,"Jim Durbin",adult,Blacklight/Fluorescent,Photograph,1,71,73,62,5,10,29.88,clear,"20% visible",
196323,,2017-014257,,"Empoasca fabae","Potato Leafhopper",Iowa,Linn,2017-09-14,1945-2230,"Hitaga Sand Ridge Prairie Preserve",42.250957,-91.632098,"Jim Durbin",adult,Blacklight/Fluorescent,Photograph,1,76,68,66,4,145,29.85,cloudy,"40 % visible",
202443,,2018-000589,,"Empoasca trifasciata",None,Iowa,Winneshiek,2012-07-05,,"100 Acre Wood-x",0,0,"MJ Hatfield",adult,,Photograph,1,,,,,,,,,
202457,,2018-000603,,"Empoasca fabae","Potato Leafhopper",Iowa,Winneshiek,2012-08-27,,"100 Acre Wood-x",0,0,"MJ Hatfield",adult,,Photograph,1,,,,,,,,,
211299,,2018-009456,,"Empoasca fabae","Potato Leafhopper",Iowa,Linn,2018-05-30,"2045 - 2315","Hitaga Sand Ridge Prairie Preserve",42.25095,-91.63209,"Jim Durbin",adult,Blacklight/Fluorescent,Photograph,1,77,56,60,7,270,29.59,"partly cloudy",full,
211999,,2018-010156,,"Empoasca fabae","Potato Leafhopper",Iowa,Linn,2018-06-11,2100-2300,"Hitaga Sand Ridge Prairie Preserve",42.250957,-91.632098,"Jim Durbin",adult,Blacklight/Fluorescent,Photograph,1,68,84,63,7,90,29.89,cloudy,"10% visible",
212015,,2018-010172,,"Empoasca fabae","Potato Leafhopper",Iowa,Linn,2018-06-11,2100-2300,"Hitaga Sand Ridge Prairie Preserve",42.250957,-91.632098,"Jim Durbin",adult,Blacklight/Fluorescent,Photograph,1,68,84,63,7,90,29.89,cloudy,"10% visible",
213860,,2018-012016,,"Empoasca fabae","Potato Leafhopper",Iowa,Linn,2018-07-03,2100-2330,"Wickiup Hill Outdoor Learning Area",42.087352,-91.767107,"Jim Durbin",adult,Blacklight/Fluorescent,Photograph,1,82,68,70,4,90,29.96,Clear,"80 % visible",
214476,,2018-012632,,"Empoasca fabae","Potato Leafhopper",Iowa,Linn,2018-07-09,2100-2330,"Hitaga Sand Ridge Prairie Preserve",42.250957,-91.632098,"Jim Durbin",adult,Blacklight/Fluorescent,Photograph,1,80,79,73,0,0,30.11,clear,"20% visible",
214477,,2018-012633,,"Empoasca fabae","Potato Leafhopper",Iowa,Linn,2018-07-09,2100-2330,"Hitaga Sand Ridge Prairie Preserve",42.250957,-91.632098,"Jim Durbin",adult,Blacklight/Fluorescent,Photograph,1,80,79,73,0,0,30.11,clear,"20% visible",
214478,,2018-012634,,"Empoasca fabae","Potato Leafhopper",Iowa,Linn,2018-07-09,2100-2330,"Hitaga Sand Ridge Prairie Preserve",42.250957,-91.632098,"Jim Durbin",adult,Blacklight/Fluorescent,Photograph,1,80,79,73,0,0,30.11,clear,"20% visible",
214480,,2018-012636,,"Empoasca fabae","Potato Leafhopper",Iowa,Linn,2018-07-09,2100-2330,"Hitaga Sand Ridge Prairie Preserve",42.250957,-91.632098,"Jim Durbin",adult,Blacklight/Fluorescent,Photograph,1,80,79,73,0,0,30.11,clear,"20% visible",
214483,,2018-012639,,"Empoasca fabae","Potato Leafhopper",Iowa,Linn,2018-07-09,2100-2330,"Hitaga Sand Ridge Prairie Preserve",42.250957,-91.632098,"Jim Durbin",adult,Blacklight/Fluorescent,Photograph,1,80,79,73,0,0,30.11,clear,"20% visible",
214485,,2018-012641,,"Empoasca fabae","Potato Leafhopper",Iowa,Linn,2018-07-09,2100-2330,"Hitaga Sand Ridge Prairie Preserve",42.250957,-91.632098,"Jim Durbin",adult,Blacklight/Fluorescent,Photograph,1,80,79,73,0,0,30.11,clear,"20% visible",
214494,,2018-012650,,"Empoasca fabae","Potato Leafhopper",Iowa,Linn,2018-07-09,2100-2330,"Hitaga Sand Ridge Prairie Preserve",42.250957,-91.632098,"Jim Durbin",adult,Blacklight/Fluorescent,Photograph,1,80,79,73,0,0,30.11,clear,"20% visible",
214498,,2018-012654,,"Empoasca fabae","Potato Leafhopper",Iowa,Linn,2018-07-09,2100-2330,"Hitaga Sand Ridge Prairie Preserve",42.250957,-91.632098,"Jim Durbin",adult,Blacklight/Fluorescent,Photograph,1,80,79,73,0,0,30.11,clear,"20% visible",
229751,,2019-004465,,"Empoasca fabae","Potato Leafhopper",Iowa,Jefferson,2018-07-15,,"Near Fairfield",41.0503,-92.024,"Moni Hayne",adult,,Photograph,1,,,,,,,,,
230194,,2019-004907,,"Empoasca fabae","Potato Leafhopper",Iowa,Linn,2019-05-25,2100-2315,"Hitaga Sand Ridge Prairie Preserve",42.250957,-91.632098,"Jim Durbin",adult,Blacklight/Fluorescent,Photograph,1,75,68,64,1,180,29.82,clear,"80% visible",
230397,,2019-005631,,"Empoasca fabae","Potato Leafhopper",Iowa,Linn,2019-05-30,,"Hitaga Sand Ridge Prairie Preserve",42.250957,-91.632098,"Jim Durbin",adult,Blacklight/Fluorescent,Photograph,1,68,81,62,,,29.82,"partly cloidy","10% visible",
233594,,2019-008306,,"Empoasca fabae","Potato Leafhopper",Iowa,Linn,2019-07-07,2100-2315,"Hitaga Sand Ridge Prairie Preserve",42.250957,-91.632098,"Jim Durbin",adult,Blacklight/Fluorescent,Photograph,1,72,59,62,2,90,29.84,"parthly cloudy","10 % visible",
237695,,,,"Empoasca fabae","Potato Leafhopper",Iowa,Linn,2019-08-24,2030-2300,"Hitaga Sand Ridge Prairie Preserve",42.250957,-91.632098,"Jim Durbin",adult,Blacklight/Fluorescent,Photograph,1,65,71,56,2,90,30.01,"partly cloudy","50% visible",
238020,,,,"Empoasca fabae","Potato Leafhopper",Iowa,Linn,2019-09-05,"2000 - 2300","Wickiup Hill Outdoor Learning Area",42.087352,-91.767107,"Jim Durbin",adult,Blacklight/Fluorescent,Photograph,1,72,71,62,3,100,29.81,clear,"50% visible",
238183,,,,"Empoasca fabae","Potato Leafhopper",Iowa,Linn,2019-09-05,"2000 - 2300","Wickiup Hill Outdoor Learning Area",42.087352,-91.767107,"Jim Durbin",adult,Blacklight/Fluorescent,Photograph,1,72,71,62,3,100,29.81,clear,"50% visible",
249097,,,,"Empoasca fabae","Potato Leafhopper",Iowa,Jefferson,2011-07-23,,"Near Fairfield",41.050511,-92.023963,"Moni Hayne",adult,Sighting,Photograph,1,,,,,,,,,
249102,,,,"Empoasca fabae","Potato Leafhopper",Iowa,Jefferson,2011-07-23,,"Near Fairfield",41.050511,-92.023963,"Moni Hayne",adult,Sighting,Photograph,1,,,,,,,,,
249114,,,,"Empoasca fabae","Potato Leafhopper",Iowa,Jefferson,2011-07-02,,"Near Fairfield",41.050511,-92.023963,"Moni Hayne",adult,Sighting,Photograph,1,,,,,,,,,
263940,,,,"Empoasca fabae","Potato Leafhopper",Iowa,Jefferson,2012-05-19,20:50:10,"Near Fairfield",41.050511,-92.023949,"Moni Hayne",adult,,Photograph,1,,,,,,,,,
266561,,,,"Empoasca fabae","Potato Leafhopper",Iowa,Lee,2020-06-05,21:10:42,"Heron Bend Conservation Area",40.570351,-91.42323,"Angella Moorehouse",adult,Blacklight/Fluorescent,Photograph,1,,,,,,,clear,"near full","night lighting at Heron Bend Conservation area with staff from Lee County Conservation Board"
266586,,,,"Empoasca fabae","Potato Leafhopper",Iowa,Lee,2020-06-05,21:10:42,"Heron Bend Conservation Area",40.570351,-91.42323,"Angella Moorehouse",adult,Blacklight/Fluorescent,Photograph,1,,,,,,,clear,"near full","night lighting at Heron Bend Conservation area with staff from Lee County Conservation Board"
270397,,,,"Empoasca fabae","Potato Leafhopper",Iowa,Jefferson,2019-07-10,22:09:32,"Jefferson County Park",40.99178878,-91.98610569,"Moni Hayne",adult,Blacklight/Fluorescent,Photograph,1,,,,,,,,,
270543,,,,"Empoasca fabae","Potato Leafhopper",Iowa,Jefferson,2013-07-24,17:05:22,"Near Fairfield",41.05082565,-92.02396273,"Moni Hayne",adult,"Building Light",Photograph,1,,,,,,,,,
270544,,,,"Empoasca fabae","Potato Leafhopper",Iowa,Jefferson,2011-07-23,23:19:55,"Near Fairfield",41.05082565,-92.02396273,"Moni Hayne",adult,"Building Light",Photograph,1,,,,,,,,,
270547,,,,"Empoasca fabae","Potato Leafhopper",Iowa,Jefferson,2013-07-04,23:46:32,"Near Fairfield",41.05082565,-92.02396273,"Moni Hayne",adult,"Building Light",Photograph,1,,,,,,,,,
270551,,,,"Empoasca fabae","Potato Leafhopper",Iowa,Jefferson,2013-07-04,22:45:57,"Near Fairfield",41.05082565,-92.02396273,"Moni Hayne",adult,"Building Light",Photograph,1,,,,,,,,,
270605,,,,"Empoasca fabae","Potato Leafhopper",Iowa,Linn,2020-06-28,22:20:19,"Wickiup Hill Outdoor Learning Area",42.08735076,-91.76706884,"Jim Durbin",adult,Blacklight/Fluorescent,Photograph,1,78,76,70,4,110,29.57,clear,"50% visible",
272003,,,,"Empoasca fabae","Potato Leafhopper",Iowa,Linn,2020-09-16,21:06:56,"Hitaga Sand Ridge Prairie Preserve",42.25083834,-91.63212487,"Jim Durbin",adult,Sighting,Photograph,1,68,76,60,2,360,30.09,cloudy,"new moon",
272054,,,,"Empoasca fabae","Potato Leafhopper",Iowa,Linn,2020-09-16,20:29:36,"Hitaga Sand Ridge Prairie Preserve",42.25083834,-91.63212487,"Jim Durbin",adult,Sighting,Photograph,1,68,76,60,2,360,30.09,cloudy,"new moon",
272072,,,,"Empoasca fabae","Potato Leafhopper",Iowa,"Van Buren",2020-09-22,19:57:37,"Shimek State Forest, Farmington Unit",40.66548334,-91.73626721,"Jim Durbin",adult,Blacklight/Fluorescent,photograph,1,70,75,61,6,160,30.09,cloudy,"30% visible",
288609,,,,"Empoasca fabae","Potato Leafhopper",Iowa,Linn,2021-06-12,21:22:46,"Pleasant Creek State Recreation Area, Linn County",42.11007461,-91.82771882,"Jim Durbin",adult,Blacklight/Fluorescent,Photograph,1,78,30,45,4,0,29.88,clear,"10% visible",
289109,,,,"Empoasca fabae","Potato Leafhopper",Iowa,Linn,2021-06-18,21:29:30,"Hitaga Sand Ridge Prairie Preserve",42.25091805,-91.63221484,"Jim Durbin",adult,Blacklight/Fluorescent,Photograph,1,84,46,61,4,180,29.75,"partly cloudy","50% visible",
291939,,,,"Empoasca fabae","Potato Leafhopper",Iowa,Linn,2021-08-15,22:24:48,"Pinicon Ridge Park",42.21087488,-91.54432767,"Jim Durbin",adult,Blacklight/Fluorescent,Photograph,1,72,46,50,3,90,29.96,clear,"50% visible",
295053,,,,"Empoasca fabae","Potato Leafhopper",Iowa,Linn,2021-08-27,20:42:48,"Hitaga Sand Ridge Prairie Preserve",42.25082009,-91.63219999,"Jim Durbin",adult,Blacklight/Fluorescent,Photograph,1,85,80,78,4,90,29.93,clear,"80% visible",
307069,,,,"Empoasca fabae","Potato Leafhopper",Iowa,Jefferson,2021-07-21,20:38:00,"Near Fairfield",41.05061219,-92.02396433,"Moni Hayne",adult,Blacklight/Fluorescent,Photograph,1,,,,,,,,,
307072,,,,"Empoasca fabae","Potato Leafhopper",Iowa,Jefferson,2021-07-21,20:37:37,"Near Fairfield",41.05061219,-92.02396433,"Moni Hayne",adult,Blacklight/Fluorescent,Photograph,1,,,,,,,,,
307080,,,,"Empoasca fabae","Potato Leafhopper",Iowa,Jefferson,2021-07-21,20:32:18,"Near Fairfield",41.05061219,-92.02396433,"Moni Hayne",adult,Blacklight/Fluorescent,Photograph,1,,,,,,,,,
309967,,,,"Empoasca fabae","Potato Leafhopper",Iowa,Linn,2022-06-09,20:35:34,"Matsell Bridge Natural Area",42.1322708,-91.38538363,"Jim Durbin",adult,Blacklight/Fluorescent,Photograph,1,68,59,53,0,0,29.95,cloudy,"60% visible",
311513,,,,"Empoasca fabae","Potato Leafhopper",Iowa,Linn,2022-07-02,21:24:07,"Wanatee County Park",42.01013441,-91.56662262,"Jim Durbin",adult,Blacklight/Fluorescent,Photograph,1,72,61,58,3,190,30.02,clear,"10% moon",
311904,,,,"Empoasca fabae","Potato Leafhopper",Iowa,Jefferson,2020-07-22,20:59:21,"Near Fairfield",41.05009748,-92.02398156,"Moni Hayne",larva,Blacklight/Fluorescent,Photograph,1,,,,,,,,,
311905,,,,"Empoasca fabae","Potato Leafhopper",Iowa,Jefferson,2020-07-22,20:52:16,"Near Fairfield",41.05009748,-92.02398156,"Moni Hayne",larva,Blacklight/Fluorescent,Photograph,1,,,,,,,,,
312729,,,,"Empoasca fabae","Potato Leafhopper",Iowa,Linn,2022-07-26,21:07:48,"Hitaga Sand Ridge Prairie Preserve",42.25103779,-91.63215575,"Jim Durbin",adult,Blacklight/Fluorescent,Photograph,1,76,79,69,1,170,29.91,cloudy,"10% moon",
313576,,,,"Empoasca fabae","Potato Leafhopper",Iowa,Linn,2022-08-17,21:56:40,"Wanatee County Park",42.01012074,-91.56658753,"Jim Durbin",adult,Blacklight/Fluorescent,Photograph,1,68,91,65,0,0,30.08,clear,"80% visible",
313897,,,,"Empoasca fabae","Potato Leafhopper",Iowa,Linn,2022-08-25,21:10:51,"Hitaga Sand Ridge Prairie Preserve",42.25103416,-91.63218888,"Jim Durbin",adult,Blacklight/Fluorescent,Photograph,1,73,90,70,2,350,30.03,clear,"10% visible",
313956,,,,"Empoasca fabae","Potato Leafhopper",Iowa,Linn,2022-08-25,20:45:58,"Hitaga Sand Ridge Prairie Preserve",42.25103416,-91.63218888,"Jim Durbin",adult,Blacklight/Fluorescent,Photograph,1,73,90,70,2,350,30.03,clear,"10% visible",
314439,,,,"Empoasca fabae","Potato Leafhopper",Iowa,Johnson,2022-08-30,20:01:19,"F. W. Kent Park",41.73491755,-91.72195511,"Jim Durbin",adult,Blacklight/Fluorescent,Photograph,1,69,72,60,0,0,30.04,clear,"10% visible",
314442,,,,"Empoasca fabae","Potato Leafhopper",Iowa,Johnson,2022-08-30,19:59:59,"F. W. Kent Park",41.73491755,-91.72195511,"Jim Durbin",adult,Blacklight/Fluorescent,Photograph,1,69,72,60,0,0,30.04,clear,"10% visible",
314567,,,,"Empoasca fabae","Potato Leafhopper",Iowa,Linn,2022-09-05,20:06:38,"Pinicon Ridge Park",42.21852221,-91.53890027,"Jim Durbin",adult,Blacklight/Fluorescent,Photograph,1,72,87,68,2,90,30.07,cloudy,"50% visible",
316429,,,,"Empoasca fabae","Potato Leafhopper",Iowa,Johnson,2022-07-01,22:55:52,Redacted,Redacted,Redacted,"Mark Brown",adult,Sighting,Photograph,1,,,,,,,,,
319572,,,,"Empoasca fabae","Potato Leafhopper",Iowa,Johnson,2022-07-06,22:14:26,Redacted,Redacted,Redacted,"Mark Brown",adult,Sighting,Photograph,1,,,,,,,,,
334371,,,,"Empoasca fabae","Potato Leafhopper",Iowa,Linn,2023-05-23,21:28:01,"Matsell Bridge Natural Area",42.13211034333333,-91.38535067666668,"Jim Durbin",adult,Blacklight/Fluorescent,Photograph,1,,,,0,,,,,
335825,,,,"Empoasca fabae","Potato Leafhopper",Iowa,Polk,2023-06-25,22:07:12,"Yellow Banks Park",41.548183631667,-93.473158521667,"Jim Durbin",adult,Blacklight/Fluorescent,Photograph,1,73,67,61,11,270,29.81,clear,"40% visible",
336071,,,,"Empoasca fabae","Potato Leafhopper",Iowa,Linn,2023-06-29,21:27:20,"Indian Creek Nature Center",41.96608977,-91.58982624,"Jim Durbin",adult,Blacklight/Fluorescent,Photograph,1,76,92,74,0,330,29.88,hazy,"50% visible",
336187,,,,"Empoasca fabae","Potato Leafhopper",Iowa,Linn,2023-06-29,22:39:55,"Indian Creek Nature Center",41.96608977,-91.58982624,"Jim Durbin",adult,Blacklight/Fluorescent,Photograph,1,76,92,74,0,330,29.88,hazy,"50% visible",
336245,,,,"Empoasca fabae","Potato Leafhopper",Iowa,Linn,2023-06-29,21:46:41,"Indian Creek Nature Center",41.96608977,-91.58982624,"Jim Durbin",adult,Blacklight/Fluorescent,Photograph,1,76,92,74,0,330,29.88,hazy,"50% visible",
336252,,,,"Empoasca fabae","Potato Leafhopper",Iowa,Linn,2023-06-29,22:55:11,"Indian Creek Nature Center",41.96608977,-91.58982624,"Jim Durbin",adult,Blacklight/Fluorescent,Photograph,1,76,92,74,0,330,29.88,hazy,"50% visible",
336737,,,,"Empoasca fabae","Potato Leafhopper",Iowa,Linn,2023-07-02,22:12:18,"1460 Douglas Ct, Marion",42.040098668333,-91.590915611667,"Jim Durbin",adult,Blacklight/Fluorescent,Photograph,1,,,,,,,,,
337092,,,,"Empoasca fabae","Potato Leafhopper",Iowa,Linn,2023-07-08,21:07:04,"Palisades Kepler State Park",41.90829802,-91.50242489,"Jim Durbin",adult,Blacklight/Fluorescent,Photograph,1,73,55,53,7,330,29.89,clear,"80% visible",
337619,,,,"Empoasca fabae","Potato Leafhopper",Iowa,Story,2023-07-13,21:29:09,"Reiman Gardens Area, Ames",42.01002794,-93.63860655,"Jim Durbin",adult,Blacklight/Fluorescent,Photograph,1,,,,,,,,,
339373,,,,"Empoasca fabae","Potato Leafhopper",Iowa,Linn,2023-08-05,21:25:35,"Pleasant Creek State Recreation Area, Linn County",42.11005504,-91.82770624,"Jim Durbin",adult,Blacklight/Fluorescent,Photograph,1,76,78,69,3,90,29.93,"partly cloudy","50% moon",
339773,,,,"Empoasca fabae","Potato Leafhopper",Iowa,Muscatine,2023-08-17,21:18:16,"Big Sand Mound Prairie Preserve, Muscatine County",41.34031372,-91.0810559,"Jim Durbin",adult,Blacklight/Fluorescent,Photograph,1,69,66,57,0,0,29.93,clear,"new moon",
340304,,,,"Empoasca fabae","Potato Leafhopper",Iowa,Linn,2023-08-20,20:21:20,"Pinicon Ridge Park",42.21852826,-91.53878734,"Jim Durbin",adult,Blacklight/Fluorescent,Photograph,1,87,73,77,2,360,30.09,"partly cloudy","10% visible",
340934,,,,"Empoasca fabae","Potato Leafhopper",Iowa,Linn,2023-08-25,21:40:15,"Hitaga Sand Ridge Prairie Preserve",42.25093191,-91.63218534,"Jim Durbin",adult,Blacklight/Fluorescent,Photograph,1,81,72,71,5,345,29.93,clear,"60% visible",
341220,,,,"Empoasca fabae","Potato Leafhopper",Iowa,Muscatine,2023-09-12,20:25:43,"Big Sand Mound Prairie Preserve, Muscatine County",41.34023049,-91.08094105,"Jim Durbin",adult,Blacklight/Fluorescent,Photograph,1,,,,,,,,,
