ID,"Collection / Source","Catalog Number","Specify Number",Taxon,"Common Name",State,County,Date,Time,Locale,Latitude,Longitude,Collector,"Life Stage","Collection Method","Preparation Type",Count,Temperature,Humidity,"Dew Point",Wind,"Wind Direction","Barometric Pressure",Sky,"Moon Phase",Notes
18647,"Jim Durbin Drawer 315-40",2014-018970,SPM004081,"Stenolophus ochropezus",None,Iowa,Linn,2005-04-19,,"Wanatee County Park",42.0094,-91.56623,"Jim Durbin",adult,Blacklight/Fluorescent,Pinned,1,,,,,,,,,
18746,,2014-019069,SPM038721,"Stenolophus ochropezus",None,Iowa,Linn,2011-05-19,,"Wanatee County Park",42.0094,-91.56623,"Jim Durbin",adult,Blacklight/Fluorescent,Photograph,1,,,,,,,,,
47108,"Jim Durbin Drawer 307-34",2014-047486,SPM001334,"Stenolophus comma",None,Iowa,Linn,2004-04-07,,"Wickiup Hill Outdoor Learning Area",42.08398,-91.7651,"Jim Durbin",adult,Blacklight,Pinned,1,,,,,,,,,
68994,,2014-069601,,"Stenolophus lecontei",None,Iowa,Muscatine,2009-06-13,,"McKeown Bridge River Access",41.41028,-91.29139,"Moni Hayne",adult,,Sighting,1,,,,,,,,,
129056,,2015-019646,,"Stenolophus lecontei",None,Iowa,Scott,2015-07-18,,Walcott,41.59151,-90.781632,"Moni Hayne",adult,,Photograph,1,,,,,,,,,
137467,,2016-002010,,"Stenolophus lecontei",None,Iowa,Johnson,2014-08-27,,Redacted,Redacted,Redacted,"Mark Brown",adult,,Photograph,1,,,,,,,,,
137545,,2016-002088,,"Stenolophus lineola",None,Iowa,Johnson,2014-06-05,,Redacted,Redacted,Redacted,"Mark Brown",adult,,Photograph,1,,,,,,,,,
137570,,2016-002113,,"Stenolophus lecontei",None,Iowa,Johnson,2013-08-25,,Redacted,Redacted,Redacted,"Mark Brown",adult,,Photograph,1,,,,,,,,,
137741,,2016-002285,,"Stenolophus ochropezus",None,Iowa,Johnson,2012-06-10,,"Iowa City",41.667,-91.545,"Mark Brown",adult,,Photograph,1,,,,,,,,,
137851,,2016-002395,,"Stenolophus ochropezus",None,Iowa,Johnson,2010-07-25,,"Iowa City",41.667,-91.545,"Mark Brown",adult,,Photograph,1,,,,,,,,,
137878,,2016-002422,,"Stenolophus comma",None,Iowa,Johnson,2009-07-06,,"Iowa City",41.667,-91.545,"Mark Brown",adult,,Photograph,1,,,,,,,,,
167163,,2016-031908,,"Stenolophus lineola",None,Iowa,Linn,2016-05-23,2030-2300,"Matsell Bridge Natural Area",42.131126,-91.388999,"Jim Durbin",adult,Blacklight/Florescent,Photograph,1,74,42,50,7,130,29.82,clear,Full,
185055,,2017-003017,,"Stenolophus lineola",None,Iowa,Scott,2016-07-30,,"Nahant Marsh Education Center",41.489953,-90.635216,"Moni Hayne",adult,,Photograph,1,,,,,,,,,
192195,,2017-010156,,"Stenolophus lecontei",None,Iowa,Linn,2017-06-03,2030-2330,"Wickiup Hill Outdoor Learning Area",42.087567,-91.767578,"Jim Durbin",adult,Blacklight/Fluorescent,Photograph,1,83,44,59,4,280,29.88,clear,"60% visible",
192198,,2017-010159,,"Stenolophus lineola",None,Iowa,Linn,2017-06-03,2030-2330,"Wickiup Hill Outdoor Learning Area",42.087567,-91.767578,"Jim Durbin",adult,Blacklight/Fluorescent,Photograph,1,83,44,59,4,280,29.88,clear,"60% visible",
192596,,2017-010557,,"Stenolophus lineola",None,Iowa,Linn,2017-06-14,2100-2330,"Wickiup Hill Outdoor Learning Area",42.087567,-91.767578,"Jim Durbin",adult,Blacklight/Fluorescent,Photograph,1,80,73,71,3,120,29.75,cloudy,"90% visible",
201752,,2017-019681,,"Stenolophus lineola",None,Iowa,Scott,2017-07-29,,"Nahant Marsh Education Center",41.489953,-90.635216,"Moni Hayne",adult,,Photograph,1,,,,,,,,,
218884,,2018-017040,,"Stenolophus lineola",None,Iowa,Linn,2018-08-16,2030-2330,"Matsell Bridge Natural Area",42.132148,-91.385221,"Jim Durbin",adult,Blacklight/Fluorescent,Photograph,1,72,83,66,5,310,29.84,"partly cloudy","30% visible",
229581,,2019-004295,,"Stenolophus lecontei",None,Iowa,Jefferson,2018-06-12,,"Near Fairfield",41.0503,-92.024,"Moni Hayne",adult,,Photograph,1,,,,,,,,,
230332,,2019-005045,,"Stenolophus lineola",None,Iowa,Linn,2019-05-25,2100-2315,"Hitaga Sand Ridge Prairie Preserve",42.250957,-91.632098,"Jim Durbin",adult,Blacklight/Fluorescent,Photograph,1,75,68,64,1,180,29.82,clear,"80% visible",
240275,,,,"Stenolophus comma",None,Iowa,Johnson,2019-05-31,,Redacted,Redacted,Redacted,"Mark Brown",adult,Sighting,Photograph,1,,,,,,,,,
265057,,,,"Stenolophus lecontei",None,Iowa,Linn,2020-05-27,21:31:32,"Matsell Bridge Natural Area",42.13204088,-91.38537304,"Jim Durbin",adult,Blacklight/Fluorescent,Photograph,1,73,94,72,0,280,29.89,cloudy,"10% visible",
266555,,,,"Stenolophus lineola",None,Iowa,Lee,2020-06-05,21:10:42,"Heron Bend Conservation Area",40.570351,-91.42323,"Angella Moorehouse",adult,Blacklight/Fluorescent,Photograph,1,,,,,,,clear,"near full","night lighting at Heron Bend Conservation area with staff from Lee County Conservation Board"
266556,,,,"Stenolophus lecontei",None,Iowa,Lee,2020-06-05,21:10:42,"Heron Bend Conservation Area",40.570351,-91.42323,"Angella Moorehouse",adult,Blacklight/Fluorescent,Photograph,1,,,,,,,clear,"near full","night lighting at Heron Bend Conservation area with staff from Lee County Conservation Board"
267255,,,,"Stenolophus lineola",None,Iowa,Linn,2020-06-15,21:24:39,"Wickiup Hill County Park",42.09988406,-91.75877833,"Jim Durbin",adult,Blacklight/Fluorescent,Photograph,1,76,37,48,2,120,30.08,"partly cloudy","50% visible",
271248,,,,"Stenolophus lecontei",None,Iowa,Story,2020-09-05,21:06:20,"Hertz Family Woods and Nature Preserve",41.98899391,-93.44316226,"Jim Durbin",adult,Blacklight/Fluorescent,Photograph,1,,,,,,,,,
271302,,,,"Stenolophus lecontei",None,Iowa,Story,2020-09-05,20:36:58,"Hertz Family Woods and Nature Preserve",41.98899391,-93.44316226,"Jim Durbin",adult,Blacklight/Fluorescent,Photograph,1,,,,,,,,,
271303,,,,"Stenolophus lecontei",None,Iowa,Story,2020-09-05,20:37:00,"Hertz Family Woods and Nature Preserve",41.98899391,-93.44316226,"Jim Durbin",adult,Blacklight/Fluorescent,Photograph,1,,,,,,,,,
272011,,,,"Stenolophus ochropezus",None,Iowa,Linn,2020-09-16,19:48:13,"Hitaga Sand Ridge Prairie Preserve",42.25083834,-91.63212487,"Jim Durbin",adult,Sighting,Photograph,1,68,76,60,2,360,30.09,cloudy,"new moon",
272168,,,,"Stenolophus comma",None,Iowa,"Van Buren",2020-09-22,19:50:03,"Shimek State Forest, Farmington Unit",40.66548334,-91.73626721,"Jim Durbin",adult,Blacklight/Fluorescent,photograph,1,70,75,61,6,160,30.09,cloudy,"30% visible",
272276,,,,"Stenolophus comma",None,Iowa,Lee,2020-09-24,19:31:55,"Shimek State Forest, Donnellson Unit",40.6445938,-91.67428614,"Jim Durbin",adult,Blacklight/Fluorescent,Photograph,1,68,77,59,8,170,29.93,clear,"30% visible",
286974,,,,"Stenolophus ochropezus",None,Iowa,Jefferson,2020-07-22,21:27:00,"Near Fairfield",41.05009748,-92.02398156,"Moni Hayne",adult,Blacklight/Fluorescent,Photograph,1,,,,,,,,,
287292,,,,"Stenolophus lecontei",None,Iowa,Henry,2021-03-20,,"Geode State Park",40.825075,-91.38047,"Mark Brown",adult,Sighting,Photograph,1,,,,,,,,,
287600,,,,"Stenolophus comma",None,Iowa,Linn,2021-05-02,21:15:40,"Hitaga Sand Ridge Prairie Preserve",42.25093489,-91.63215084,"Jim Durbin",adult,Blacklight/Fluorescent,Photograph,1,77,55,59,15,270,29.51,Cloudy,"90 % visible",
290139,,,,"Stenolophus lecontei",None,Iowa,Henry,2021-03-20,,"Geode State Park",40.822911,-91.384579,"Mark Brown",adult,Sighting,Photograph,1,,,,,,,,,
307050,,,,"Stenolophus ochropezus",None,Iowa,Jefferson,2021-07-21,20:50:49,"Near Fairfield",41.05061219,-92.02396433,"Moni Hayne",adult,Blacklight/Fluorescent,Photograph,1,,,,,,,,,
307136,,,,"Stenolophus ochropezus",None,Iowa,Jefferson,2021-07-21,20:55:59,"Near Fairfield",41.05061219,-92.02396433,"Moni Hayne",adult,Blacklight/Fluorescent,Photograph,1,,,,,,,,,
307413,,,,"Stenolophus lecontei",None,Iowa,Jefferson,2021-07-22,0:08:19,"Near Fairfield",41.05061219,-92.02396433,"Moni Hayne",adult,Blacklight/Fluorescent,Photograph,1,,,,,,,,,
309915,,,,"Stenolophus comma",None,Iowa,Linn,2022-06-09,21:07:51,"Matsell Bridge Natural Area",42.1322708,-91.38538363,"Jim Durbin",adult,Blacklight/Fluorescent,Photograph,1,68,59,53,0,0,29.95,cloudy,"60% visible",
310141,,,,"Stenolophus comma",None,Iowa,Linn,2022-06-12,20:47:44,"Pinicon Ridge Park",42.21093766,-91.54432936,"Jim Durbin",adult,Sighting,Photograph,1,79,78,70,0,0,29.85,clear,full,
311588,,,,"Stenolophus comma",None,Iowa,Linn,2022-07-02,20:48:47,"Wanatee County Park",42.01013441,-91.56662262,"Jim Durbin",adult,Blacklight/Fluorescent,Photograph,1,72,61,58,3,190,30.02,clear,"10% moon",
311601,,,,"Stenolophus lecontei",None,Iowa,Linn,2022-07-02,20:42:41,"Wanatee County Park",42.01013441,-91.56662262,"Jim Durbin",adult,Blacklight/Fluorescent,Photograph,1,72,61,58,3,190,30.02,clear,"10% moon",
312047,,,,"Stenolophus lecontei",None,Iowa,Jefferson,2021-07-22,0:08:19,"Near Fairfield",41.05061219,-92.02396433,"Moni Hayne",adult,Blacklight/Fluorescent,Photograph,1,,,,,,,,,
313411,,,,"Stenolophus ochropezus",None,Iowa,Lee,2022-08-13,21:08:17,"Shimek State Forest, Donnellson Unit",40.650257,-91.681611,"Angella Moorehouse",adult,Blacklight/Fluorescent,Photograph,1,,,,,,,,,
314464,,,,"Stenolophus comma",None,Iowa,Linn,2022-09-05,21:40:43,"Pinicon Ridge Park",42.21852221,-91.53890027,"Jim Durbin",adult,Blacklight/Fluorescent,Photograph,1,72,87,68,2,90,30.07,cloudy,"50% visible",
314756,,,,"Stenolophus ochropezus",None,Iowa,Linn,2022-09-15,20:40:44,"Matsell Bridge Natural Area",42.13206715,-91.38532979,"Jim Durbin",adult,Blacklight/Fluorescent,Photograph,1,80,54,64,3,180,30.05,"partly cloudy","90% visible",
315431,,,,"Stenolophus lineola",None,Iowa,Johnson,2022-05-31,22:12:43,Redacted,Redacted,Redacted,"Mark Brown",adult,Sighting,Photograph,1,,,,,,,,,
315434,,,,"Stenolophus comma",None,Iowa,Johnson,2022-05-31,23:06:59,Redacted,Redacted,Redacted,"Mark Brown",adult,Sighting,Photograph,1,,,,,,,,,
320425,,,,"Stenolophus lineola",None,Iowa,Johnson,2022-07-11,22:32:01,Redacted,Redacted,Redacted,"Mark Brown",adult,Sighting,Photograph,1,,,,,,,,,
334386,,,,"Stenolophus comma",None,Iowa,Linn,2023-05-23,21:22:01,"Matsell Bridge Natural Area",42.13211034333333,-91.38535067666666,"Jim Durbin",adult,Blacklight/Fluorescent,Photograph,1,,,,0,,,,,
334628,,,,"Stenolophus lecontei",None,Iowa,Linn,2023-05-30,21:47:08,"Hitaga Sand Ridge Prairie Preserve",42.25073718,-91.63212197,"Jim Durbin",adult,Blacklight/Fluorescent,Photograph,1,71,57,55,0,0,29.91,"partly cloudy","90% visible",
335254,,,,"Stenolophus comma",None,Iowa,Linn,2023-06-17,22:35:15,"Wanatee County Park",42.010114365,-91.566550498333,"Jim Durbin",adult,Blacklight/Fluorescent,Photograph,1,75,54,57,2,90,29.84,c;ear,"no moon",
335320,,,,"Stenolophus comma",None,Iowa,Linn,2023-06-17,22:56:56,"Wanatee County Park",42.010114365,-91.566550498333,"Jim Durbin",adult,Blacklight/Fluorescent,Photograph,1,75,54,57,2,90,29.84,c;ear,"no moon",
336106,,,,"Stenolophus ochropezus",None,Iowa,Linn,2023-06-29,21:53:47,"Indian Creek Nature Center",41.96608977,-91.58982624,"Jim Durbin",adult,Blacklight/Fluorescent,Photograph,1,76,92,74,0,330,29.88,hazy,"50% visible",
337640,,,,"Stenolophus ochropezus",None,Iowa,Story,2023-07-13,22:03:55,"Reiman Gardens Area, Ames",42.01002794,-93.63860655,"Jim Durbin",adult,Blacklight/Fluorescent,Photograph,1,,,,,,,,,
338091,,,,"Stenolophus comma",None,Iowa,Muscatine,2023-07-18,22:02:48,"Big Sand Mound Prairie Preserve, Muscatine County",41.34026787,-91.08103262,"Jim Durbin",adult,Blacklight/Fluorescent,Photograph,1,72,70,62,0,90,29.99,"partly cloudy","new moon",
338093,,,,"Stenolophus comma",None,Iowa,Muscatine,2023-07-18,22:02:50,"Big Sand Mound Prairie Preserve, Muscatine County",41.34026787,-91.08103262,"Jim Durbin",adult,Blacklight/Fluorescent,Photograph,1,72,70,62,0,90,29.99,"partly cloudy","new moon",
338281,,,,"Stenolophus ochropezus",None,Iowa,Linn,2023-07-20,22:17:41,"Palisades Kepler State Park",41.90828891,-91.50245954,"Jim Durbin",adult,Sighting,Photograph,1,75,63,61,2,330,30,"partly cloudy","10% visible",
338435,,,,"Stenolophus ochropezus",None,Iowa,Johnson,2023-07-22,21:26:55,"F. W. Kent Park",41.73493888,-91.7219024,"Jim Durbin",adult,Blacklight/Fluorescent,Photograph,1,76,70,65,0,0,29.89,"partly cloudy","10% moon",
338662,,,,"Stenolophus ochropezus",None,Iowa,Linn,2023-07-25,21:11:43,"Pinicon Ridge Park",42.2108105,-91.54420598,"Jim Durbin",adult,Blacklight/Fluorescent,Photograph,1,85,71,75,4,110,29.8,"partly cloudy","40 % visible",
341421,,,,"Stenolophus ochropezus",None,Iowa,Linn,2023-09-05,22:08:20,"Wanatee County Park",42.010077715,-91.566528441667,"Jim Durbin",adult,Blacklight/Fluorescent,Photograph,1,84,63,70,13,180,29.73,cloudy,"80% moon",
341617,,,,"Stenolophus comma",None,Iowa,Linn,2023-10-01,19:36:53,"Palisades Kepler State Park",41.90828729,-91.50237809,"Jim Durbin",adult,Blacklight/Fluorescent,Photograph,1,81,50,57,11,160,30.15,clear,"50% visible",
352017,,,,"Stenolophus rotundicollis",None,Iowa,Winneshiek,1994-06-13,,"Aikman Prairie",43.3238,-91.8095,"Lea F Miller",adult,,,1,,,,,,,,,"Data from Kirk Larsen, Luther College"
352018,,,,"Stenolophus rotundicollis",None,Iowa,Winneshiek,1994-06-13,,"Aikman Prairie",43.3238,-91.8095,"Lea F Miller",adult,,,1,,,,,,,,,"Data from Kirk Larsen, Luther College"
353271,,,,"Stenolophus comma",None,Iowa,Winneshiek,1998-06-26,,"Anderson Prairie, Decorah",43.315099,-91.800701,"Kirk J. Larsen",adult,,,1,,,,,,,,,"Data from Kirk Larsen, Luther College"
353272,,,,"Stenolophus comma",None,Iowa,Winneshiek,1998-06-26,,"Anderson Prairie, Decorah",43.315099,-91.800701,"Kirk J. Larsen",adult,,,1,,,,,,,,,"Data from Kirk Larsen, Luther College"
353273,,,,"Stenolophus comma",None,Iowa,Winneshiek,2000-05-02,,"Anderson Prairie, Decorah",43.315099,-91.800701,"Jessica Givens",adult,,,1,,,,,,,,,"Data from Kirk Larsen, Luther College"
353274,,,,"Stenolophus comma",None,Iowa,Winneshiek,1999-05-31,,"Anderson Prairie, Decorah",43.315099,-91.800701,"Kirk J. Larsen",adult,,,1,,,,,,,,,"Data from Kirk Larsen, Luther College"
353275,,,,"Stenolophus conjunctus",None,Iowa,Winneshiek,1998-07-30,,"Anderson Prairie, Decorah",43.315099,-91.800701,"Kirk J. Larsen",adult,,,1,,,,,,,,,"Data from Kirk Larsen, Luther College"
353276,,,,"Stenolophus conjunctus",None,Iowa,Winneshiek,1999-06-19,,"Anderson Prairie, Decorah",43.315099,-91.800701,"Kirk J. Larsen",adult,,,1,,,,,,,,,"Data from Kirk Larsen, Luther College"
353277,,,,"Stenolophus conjunctus",None,Iowa,Winneshiek,2007-07-20,,"Anderson Prairie, Decorah",43.315099,-91.800701,"Brian Rouse",adult,,,1,,,,,,,,,"Data from Kirk Larsen, Luther College"
353278,,,,"Stenolophus fuliginosus",None,Iowa,Winneshiek,1996-04-16,,"Anderson Prairie, Decorah",43.315099,-91.800701,"Jason Williams",adult,,,1,,,,,,,,,"Data from Kirk Larsen, Luther College"
353279,,,,"Stenolophus lecontei",None,Iowa,Winneshiek,1996-09-02,,"Anderson Prairie, Decorah",43.315099,-91.800701,"Kirk J. Larsen",adult,,,1,,,,,,,,,"Data from Kirk Larsen, Luther College"
353280,,,,"Stenolophus lecontei",None,Iowa,Winneshiek,1999-05-31,,"Anderson Prairie, Decorah",43.315099,-91.800701,"Kirk J. Larsen",adult,,,1,,,,,,,,,"Data from Kirk Larsen, Luther College"
353281,,,,"Stenolophus ochropezus",None,Iowa,Winneshiek,1998-06-26,,"Anderson Prairie, Decorah",43.315099,-91.800701,"Kirk J. Larsen",adult,,,1,,,,,,,,,"Data from Kirk Larsen, Luther College"
353282,,,,"Stenolophus ochropezus",None,Iowa,Winneshiek,1998-06-26,,"Anderson Prairie, Decorah",43.315099,-91.800701,"Kirk J. Larsen",adult,,,1,,,,,,,,,"Data from Kirk Larsen, Luther College"
353283,,,,"Stenolophus ochropezus",None,Iowa,Winneshiek,1998-06-26,,"Anderson Prairie, Decorah",43.315099,-91.800701,"Kirk J. Larsen",adult,,,1,,,,,,,,,"Data from Kirk Larsen, Luther College"
353284,,,,"Stenolophus ochropezus",None,Iowa,Winneshiek,2000-09-04,,"Anderson Prairie, Decorah",43.315099,-91.800701,"Jessica Givens",adult,,,1,,,,,,,,,"Data from Kirk Larsen, Luther College"
353285,,,,"Stenolophus ochropezus",None,Iowa,Winneshiek,2000-05-02,,"Anderson Prairie, Decorah",43.315099,-91.800701,"Jessica Givens",adult,,,1,,,,,,,,,"Data from Kirk Larsen, Luther College"
353286,,,,"Stenolophus ochropezus",None,Iowa,Winneshiek,2003-06-05,,"Anderson Prairie, Decorah",43.315099,-91.800701,"Deneb Woods",adult,,,1,,,,,,,,,"Data from Kirk Larsen, Luther College"
353287,,,,"Stenolophus ochropezus",None,Iowa,Winneshiek,2001-06-14,,"Anderson Prairie, Decorah",43.315099,-91.800701,"Kirk J. Larsen",adult,,,1,,,,,,,,,"Data from Kirk Larsen, Luther College"
353288,,,,"Stenolophus ochropezus",None,Iowa,Winneshiek,2001-05-22,,"Anderson Prairie, Decorah",43.315099,-91.800701,"Kirk J. Larsen",adult,,,1,,,,,,,,,"Data from Kirk Larsen, Luther College"
353289,,,,"Stenolophus rotundicollis",None,Iowa,Winneshiek,2000-05-30,,"Anderson Prairie, Decorah",43.315099,-91.800701,"Jessica Givens",adult,,,1,,,,,,,,,"Data from Kirk Larsen, Luther College"
353290,,,,"Stenolophus rotundicollis",None,Iowa,Winneshiek,1998-07-17,,"Anderson Prairie, Decorah",43.315099,-91.800701,"David Wente",adult,,,1,,,,,,,,,"Data from Kirk Larsen, Luther College"
353291,,,,"Stenolophus rotundicollis",None,Iowa,Winneshiek,1998-07-03,,"Anderson Prairie, Decorah",43.315099,-91.800701,"David Wente",adult,,,1,,,,,,,,,"Data from Kirk Larsen, Luther College"
353292,,,,"Stenolophus rotundicollis",None,Iowa,Winneshiek,1998-07-03,,"Anderson Prairie, Decorah",43.315099,-91.800701,"David Wente",adult,,,1,,,,,,,,,"Data from Kirk Larsen, Luther College"
353293,,,,"Stenolophus rotundicollis",None,Iowa,Winneshiek,2003-07-17,,"Anderson Prairie, Decorah",43.315099,-91.800701,"Deneb Woods",adult,,,1,,,,,,,,,"Data from Kirk Larsen, Luther College"
353294,,,,"Stenolophus rotundicollis",None,Iowa,Winneshiek,2001-06-14,,"Anderson Prairie, Decorah",43.315099,-91.800701,"Kirk J. Larsen",adult,,,1,,,,,,,,,"Data from Kirk Larsen, Luther College"
353295,,,,"Stenolophus rotundicollis",None,Iowa,Winneshiek,2001-05-22,,"Anderson Prairie, Decorah",43.315099,-91.800701,"Kirk J. Larsen",adult,,,1,,,,,,,,,"Data from Kirk Larsen, Luther College"
353296,,,,"Stenolophus rotundicollis",None,Iowa,Winneshiek,1999-05-31,,"Anderson Prairie, Decorah",43.315099,-91.800701,"Kirk J. Larsen",adult,,,1,,,,,,,,,"Data from Kirk Larsen, Luther College"
353510,,,,"Stenolophus lineola",None,Michigan,Kalkaska,1982-06-01,,"Big Twin Lake",44.82285,-84.9551,"Kirk J. Larsen",adult,,,1,,,,,,,,,"Data from Kirk Larsen, Luther College"
353579,,,,"Stenolophus comma",None,Iowa,Winneshiek,1993-10-10,,"Winneshiek County",43.236424,-91.909925,"Wade Coplin",adult,,,1,,,,,,,,,"Bornes Farm"
353600,,,,"Stenolophus comma",None,"South Dakota",Pennington,2006-06-21,,"Canyon Lake Park",44.0583,-103.287,"Kirk J. Larsen",adult,,,1,,,,,,,,,"Data from Kirk Larsen, Luther College"
353847,,,,"Stenolophus comma",None,Minnesota,Anoka,2000-07-06,,"Cedar Creek Natural History Area",45.40295,-93.189233,"Kirk J. Larsen",adult,,,1,,,,,,,,,"Data from Kirk Larsen, Luther College"
353848,,,,"Stenolophus lineola",None,Minnesota,Anoka,2000-06-20,,"Cedar Creek Natural History Area",45.40295,-93.189233,"Kirk J. Larsen",adult,,,1,,,,,,,,,"Data from Kirk Larsen, Luther College"
353849,,,,"Stenolophus lineola",None,Minnesota,Anoka,2000-07-06,,"Cedar Creek Natural History Area",45.40295,-93.189233,"Kirk J. Larsen",adult,,,1,,,,,,,,,"Data from Kirk Larsen, Luther College"
353850,,,,"Stenolophus ochropezus",None,Minnesota,Anoka,2000-06-28,,"Cedar Creek Natural History Area",45.40295,-93.189233,"Kirk J. Larsen",adult,,,1,,,,,,,,,"Data from Kirk Larsen, Luther College"
353851,,,,"Stenolophus ochropezus",None,Minnesota,Anoka,2000-07-06,,"Cedar Creek Natural History Area",45.40295,-93.189233,"Kirk J. Larsen",adult,,,1,,,,,,,,,"Data from Kirk Larsen, Luther College"
353852,,,,"Stenolophus ochropezus",None,Minnesota,Anoka,2000-07-06,,"Cedar Creek Natural History Area",45.40295,-93.189233,"Kirk J. Larsen",adult,,,1,,,,,,,,,"Data from Kirk Larsen, Luther College"
353853,,,,"Stenolophus ochropezus",None,Minnesota,Anoka,2000-07-06,,"Cedar Creek Natural History Area",45.40295,-93.189233,"Kirk J. Larsen",adult,,,1,,,,,,,,,"Data from Kirk Larsen, Luther College"
353854,,,,"Stenolophus ochropezus",None,Minnesota,Anoka,2000-07-06,,"Cedar Creek Natural History Area",45.40295,-93.189233,"Kirk J. Larsen",adult,,,1,,,,,,,,,"Data from Kirk Larsen, Luther College"
353855,,,,"Stenolophus rotundicollis",None,Minnesota,Anoka,2000-09-13,,"Cedar Creek Natural History Area",45.40295,-93.189233,"Kirk J. Larsen",adult,,,1,,,,,,,,,"Data from Kirk Larsen, Luther College"
353866,,,,"Stenolophus comma",None,Iowa,Linn,1989-08-03,,"Cedar Rapids-x",41.9925,-91.6545,"Doug Veal",adult,,,1,,,,,,,,,"Data from Kirk Larsen, Luther College"
354211,,,,"Stenolophus ochropezus",None,Iowa,Winneshiek,1994-08-06,,"Chipera Prairie Park",43.1325,-92.0075,"Lea F Miller",adult,,,1,,,,,,,,,"Data from Kirk Larsen, Luther College"
354212,,,,"Stenolophus ochropezus",None,Iowa,Winneshiek,1994-08-06,,"Chipera Prairie Park",43.1325,-92.0075,"Lea F Miller",adult,,,1,,,,,,,,,"Data from Kirk Larsen, Luther College"
354388,,,,"Stenolophus conjunctus",None,"South Dakota",Lawrence,1994-07-10,,"Dalton Lake",44.230833,-103.4735,"Lea F Miller",adult,,,1,,,,,,,,,"Data from Kirk Larsen, Luther College"
354676,,,,"Stenolophus comma",None,Iowa,Winneshiek,1997-06-16,,Decorah-x,43.30333,-91.78556,"Kirk J. Larsen",adult,,,1,,,,,,,,,"Data from Kirk Larsen, Luther College"
354677,,,,"Stenolophus comma",None,Iowa,Winneshiek,1997-06-16,,Decorah-x,43.30333,-91.78556,"Kirk J. Larsen",adult,,,1,,,,,,,,,"Data from Kirk Larsen, Luther College"
354678,,,,"Stenolophus comma",None,Iowa,Winneshiek,1997-06-16,,Decorah-x,43.30333,-91.78556,"Kirk J. Larsen",adult,,,1,,,,,,,,,"Data from Kirk Larsen, Luther College"
354679,,,,"Stenolophus lecontei",None,Iowa,Winneshiek,1997-06-16,,Decorah-x,43.30333,-91.78556,"Kirk J. Larsen",adult,,,1,,,,,,,,,"Data from Kirk Larsen, Luther College"
354680,,,,"Stenolophus lecontei",None,Iowa,Winneshiek,1997-06-16,,Decorah-x,43.30333,-91.78556,"Kirk J. Larsen",adult,,,1,,,,,,,,,"Data from Kirk Larsen, Luther College"
354681,,,,"Stenolophus lecontei",None,Iowa,Winneshiek,1997-06-16,,Decorah-x,43.30333,-91.78556,"Kirk J. Larsen",adult,,,1,,,,,,,,,"Data from Kirk Larsen, Luther College"
354682,,,,"Stenolophus lecontei",None,Iowa,Winneshiek,1997-06-16,,Decorah-x,43.30333,-91.78556,"Kirk J. Larsen",adult,,,1,,,,,,,,,"Data from Kirk Larsen, Luther College"
354683,,,,"Stenolophus ochropezus",None,Iowa,Winneshiek,1997-06-16,,Decorah-x,43.30333,-91.78556,"Kirk J. Larsen",adult,,,1,,,,,,,,,"Data from Kirk Larsen, Luther College"
354684,,,,"Stenolophus ochropezus",None,Iowa,Winneshiek,1997-06-16,,Decorah-x,43.30333,-91.78556,"Kirk J. Larsen",adult,,,1,,,,,,,,,"Data from Kirk Larsen, Luther College"
354685,,,,"Stenolophus ochropezus",None,Iowa,Winneshiek,1997-06-16,,Decorah-x,43.30333,-91.78556,"Kirk J. Larsen",adult,,,1,,,,,,,,,"Data from Kirk Larsen, Luther College"
354686,,,,"Stenolophus ochropezus",None,Iowa,Winneshiek,1997-06-16,,Decorah-x,43.30333,-91.78556,"Kirk J. Larsen",adult,,,1,,,,,,,,,"Data from Kirk Larsen, Luther College"
354687,,,,"Stenolophus ochropezus",None,Iowa,Winneshiek,1997-06-16,,Decorah-x,43.30333,-91.78556,"Kirk J. Larsen",adult,,,1,,,,,,,,,"Data from Kirk Larsen, Luther College"
354688,,,,"Stenolophus ochropezus",None,Iowa,Winneshiek,1997-06-16,,Decorah-x,43.30333,-91.78556,"Kirk J. Larsen",adult,,,1,,,,,,,,,"Data from Kirk Larsen, Luther College"
354689,,,,"Stenolophus ochropezus",None,Iowa,Winneshiek,1997-06-16,,Decorah-x,43.30333,-91.78556,"Kirk J. Larsen",adult,,,1,,,,,,,,,"Data from Kirk Larsen, Luther College"
354690,,,,"Stenolophus ochropezus",None,Iowa,Winneshiek,1997-06-16,,Decorah-x,43.30333,-91.78556,"Kirk J. Larsen",adult,,,1,,,,,,,,,"Data from Kirk Larsen, Luther College"
354691,,,,"Stenolophus ochropezus",None,Iowa,Winneshiek,1997-06-16,,Decorah-x,43.30333,-91.78556,"Kirk J. Larsen",adult,,,1,,,,,,,,,"Data from Kirk Larsen, Luther College"
354915,,,,"Stenolophus comma",None,Ohio,Butler,1991-07-03,,"Miami University Ecology Research Center",39.53163,-84.72354,"Kirk J. Larsen",adult,,,1,,,,,,,,,"Data from Kirk Larsen, Luther College"
354916,,,,"Stenolophus conjunctus",None,Ohio,Butler,1991-07-03,,"Miami University Ecology Research Center",39.53163,-84.72354,"Kirk J. Larsen",adult,,,1,,,,,,,,,"Data from Kirk Larsen, Luther College"