ID,"Collection / Source","Catalog Number","Specify Number",Taxon,"Common Name",State,County,Date,Time,Locale,Latitude,Longitude,Collector,"Life Stage","Collection Method","Preparation Type",Count,Temperature,Humidity,"Dew Point",Wind,"Wind Direction","Barometric Pressure",Sky,"Moon Phase",Notes
303,"Frank Olsen Drawer 44",2014-000303,SPM010638,"Euphyia intermediata","Sharp-angled Carpet",Iowa,Linn,2007-09-05,,"Pleasant Creek State Recreation Area, Linn County",42.11952,-91.81215,"Frank Olsen",adult,,Pinned,1,,,,,,,,,"Located at Iowa State"
305,"Frank Olsen Drawer 44",2014-000305,SPM010639,"Euphyia intermediata","Sharp-angled Carpet",Iowa,Linn,2007-09-05,,"Pleasant Creek State Recreation Area, Linn County",42.11952,-91.81215,"Frank Olsen",adult,,Pinned,1,,,,,,,,,"Located at Iowa State"
306,"Frank Olsen Drawer 44",2014-000306,SPM010640,"Euphyia intermediata","Sharp-angled Carpet",Iowa,Floyd,2007-05-27,,"Wentland Woods",43.14467,-92.71167,"Frank Olsen",adult,,Pinned,1,,,,,,,,,"Located at Iowa State"
307,"Frank Olsen Drawer 44",2014-000307,SPM010641,"Euphyia intermediata","Sharp-angled Carpet",Iowa,Linn,2007-08-21,,"Pinicon Ridge Park",42.21188,-91.54753,"Frank Olsen",adult,,Pinned,1,,,,,,,,,"Located at Iowa State"
11733,"Jim Durbin Drawer 072",2014-012015,SPM040668,"Euphyia intermediata","Sharp-angled Carpet",Iowa,Jackson,2014-06-06,,"Green Island Wildlife Management Area",42.15056,-90.27722,"Tom Jantscher",adult,,Pinned,1,,,,,,,,,
25831,"Frank Olsen Drawer 44",2014-026178,SPM032842,"Euphyia intermediata","Sharp-angled Carpet",Iowa,Linn,2012-09-19,,"Pleasant Creek State Recreation Area, Linn County",42.11952,-91.81215,"Frank Olsen",adult,,Pinned,1,,,,,,,,,"Located at Iowa State"
27059,"Frank Olsen Drawer 44",2014-027412,SPM002790,"Euphyia intermediata","Sharp-angled Carpet",Iowa,Linn,2004-05-25,2110-2230,"Behren's Pond Woodland State Preserve",42.118214,-91.754324,"Frank Olsen",adult,Blacklight,Pinned,1,55-49,,,light,,,clear,"25% visible","Located at Iowa State"
27060,"Frank Olsen Drawer 44",2014-027413,SPM002791,"Euphyia intermediata","Sharp-angled Carpet",Iowa,Linn,2004-05-06,,"Wickiup Hill Outdoor Learning Area",42.08398,-91.7651,"Frank Olsen",adult,,Pinned,1,,,,,,,,,"Located at Iowa State"
27061,"Frank Olsen Drawer 44",2014-027414,SPM002792,"Euphyia intermediata","Sharp-angled Carpet",Iowa,Linn,2004-05-19,,"Wickiup Hill Outdoor Learning Area",42.08398,-91.7651,"Frank Olsen",adult,,Pinned,1,,,,,,,,,"Located at Iowa State"
27062,,2014-027415,SPM003611,"Euphyia intermediata","Sharp-angled Carpet",Iowa,Jasper,2003-05-15,,"Neal Smith National Wildlife Refuge",41.5678,-93.2675,"Keith Summerville",adult,,Pinned,1,,,,,,,,,
27063,"Jim Durbin Drawer 072",2014-027416,SPM004115,"Euphyia intermediata","Sharp-angled Carpet",Iowa,Linn,2005-05-23,,"Wickiup Hill Outdoor Learning Area",42.08398,-91.7651,"Jim Durbin",adult,"Building Light",Pinned,1,,,,,,,,,
27064,"Jim Durbin Drawer 072",2014-027417,SPM004531,"Euphyia intermediata","Sharp-angled Carpet",Iowa,Linn,2005-05-31,,"Wickiup Hill Outdoor Learning Area",42.08398,-91.7651,"Jim Durbin",adult,Blacklight/Fluorescent,Pinned,1,,,,,,,,,
27065,"Jim Durbin Drawer 072",2014-027418,SPM005136,"Euphyia intermediata","Sharp-angled Carpet",Iowa,Linn,2005-09-04,,"Matsell Bridge Natural Area",42.13131,-91.38886,"Jim Durbin",adult,Blacklight/Fluorescent,Pinned,1,,,,,,,,,
27066,"Jim Durbin Drawer 072",2014-027419,SPM005235,"Euphyia intermediata","Sharp-angled Carpet",Iowa,Allamakee,2005-08-20,,"Yellow River State Forest",43.13753,-91.22503,"Jim Durbin",adult,Blacklight/Fluorescent,Pinned,1,,,,,,,,,
27067,"Frank Olsen Drawer 44",2014-027420,SPM005640,"Euphyia intermediata","Sharp-angled Carpet",Iowa,Linn,2005-06-29,,"Rock Island Botanical State Preserve",42.02732,-91.72723,"Frank Olsen",adult,,Pinned,1,,,,,,,,,"Located at Iowa State"
27068,"Frank Olsen Drawer 44",2014-027421,SPM005641,"Euphyia intermediata","Sharp-angled Carpet",Iowa,Linn,2005-04-08,,"J. Harold Ennis County Park",41.898488,-91.483092,"Frank Olsen",adult,,Pinned,1,,,,,,,,,"Located at Iowa State"
27069,"Frank Olsen Drawer 44",2014-027422,SPM005642,"Euphyia intermediata","Sharp-angled Carpet",Iowa,Allamakee,2005-09-02,,"Yellow River State Forest",43.1676,-91.254,"Frank Olsen",adult,,Pinned,1,,,,,,,,,"Located at Iowa State"
27070,"Frank Olsen Drawer 44",2014-027423,SPM005643,"Euphyia intermediata","Sharp-angled Carpet",Iowa,Allamakee,2005-09-02,,"Yellow River State Forest",43.1676,-91.254,"Frank Olsen",adult,,Pinned,1,,,,,,,,,"Located at Iowa State"
27071,"Frank Olsen Drawer 44",2014-027424,SPM005644,"Euphyia intermediata","Sharp-angled Carpet",Iowa,Allamakee,2005-09-02,,"Yellow River State Forest",43.1676,-91.254,"Frank Olsen",adult,,Pinned,1,,,,,,,,,"Located at Iowa State"
27072,"Frank Olsen Drawer 44",2014-027425,SPM005645,"Euphyia intermediata","Sharp-angled Carpet",Iowa,Delaware,2005-08-16,,"Backbone State Park",42.616,-91.5585,"Frank Olsen",adult,,Pinned,1,,,,,,,,,"Located at Iowa State"
27073,"Frank Olsen Drawer 44",2014-027426,SPM005646,"Euphyia intermediata","Sharp-angled Carpet",Iowa,Delaware,2005-08-16,,"Backbone State Park",42.616,-91.5585,"Frank Olsen",adult,,Pinned,1,,,,,,,,,"Located at Iowa State"
27074,"Jim Durbin Drawer 072",2014-027427,SPM006772,"Euphyia intermediata","Sharp-angled Carpet",Iowa,Linn,2006-07-14,,"Pleasant Creek State Recreation Area, Linn County",42.11952,-91.81215,"Jim Durbin",adult,Blacklight/Fluorescent,Pinned,1,,,,,,,,,
27075,"Jim Durbin Drawer 072",2014-027428,SPM006877,"Euphyia intermediata","Sharp-angled Carpet",Iowa,Linn,2006-07-18,,"Pleasant Creek State Recreation Area, Linn County",42.11952,-91.81215,"Jim Durbin",adult,Blacklight/Fluorescent,Pinned,1,,,,,,,,,
27076,"Jim Durbin Drawer 072",2014-027429,SPM006923,"Euphyia intermediata","Sharp-angled Carpet",Iowa,Linn,2006-07-24,,"Pleasant Creek State Recreation Area, Linn County",42.11952,-91.81215,"Jim Durbin",adult,Blacklight/Fluorescent,Pinned,1,,,,,,,,,
27077,"Jim Durbin Drawer 072",2014-027430,SPM007040,"Euphyia intermediata","Sharp-angled Carpet",Iowa,Linn,2006-08-01,,"Pleasant Creek State Recreation Area, Linn County",42.11952,-91.81215,"Jim Durbin",adult,Blacklight/Fluorescent,Pinned,1,,,,,,,,,
27078,"Jim Durbin Drawer 072",2014-027431,SPM007134,"Euphyia intermediata","Sharp-angled Carpet",Iowa,Linn,2006-08-23,,"Pleasant Creek State Recreation Area, Linn County",42.11952,-91.81215,"Jim Durbin",adult,Blacklight/Fluorescent,Pinned,1,,,,,,,,,
27079,"Frank Olsen Drawer 44",2014-027432,SPM008261,"Euphyia intermediata","Sharp-angled Carpet",Iowa,Muscatine,2006-05-23,,"Wildcat Den State Park",41.4705,-90.88228,"Frank Olsen",adult,,Pinned,1,,,,,,,,,"Located at Iowa State"
27080,"Frank Olsen Drawer 44",2014-027433,SPM008262,"Euphyia intermediata","Sharp-angled Carpet",Iowa,Linn,2006-06-03,2100-2336,"Palisades Kepler State Park",41.90833,-91.50238,"Frank Olsen",adult,,Pinned,1,71-73,,,,,,"Mostly clear","3rd quarter","Located at Iowa State"
27081,"Jim Durbin Drawer 072",2014-027434,SPM008689,"Euphyia intermediata","Sharp-angled Carpet",Iowa,Linn,2007-06-30,,"Wanatee County Park",42.0094,-91.56623,"Jim Durbin",adult,Blacklight/Fluorescent,Pinned,1,,,,,,,,,
27082,"Jim Durbin Drawer 072",2014-027435,SPM008865,"Euphyia intermediata","Sharp-angled Carpet",Iowa,Clayton,2007-06-28,,"Fern Ridge Fish and Wildlife Service",42.84298,-91.36977,"Jim Durbin",adult,Blacklight/Fluorescent,Pinned,1,,,,,,,,,
27083,"Jim Durbin Drawer 072",2014-027436,SPM008958,"Euphyia intermediata","Sharp-angled Carpet",Iowa,Linn,2007-07-12,,"Pleasant Creek State Recreation Area, Linn County",42.11952,-91.81215,"Jim Durbin",adult,Blacklight/Fluorescent,Pinned,1,,,,,,,,,
27084,"Jim Durbin Drawer 072",2014-027437,SPM008959,"Euphyia intermediata","Sharp-angled Carpet",Iowa,Linn,2007-07-12,,"Pleasant Creek State Recreation Area, Linn County",42.11952,-91.81215,"Jim Durbin",adult,Blacklight/Fluorescent,Pinned,1,,,,,,,,,
27085,"Jim Durbin Drawer 072",2014-027438,SPM008962,"Euphyia intermediata","Sharp-angled Carpet",Iowa,Linn,2007-07-12,,"Pleasant Creek State Recreation Area, Linn County",42.11952,-91.81215,"Jim Durbin",adult,Blacklight/Fluorescent,Pinned,1,,,,,,,,,
27086,"Jim Durbin Drawer 072",2014-027439,SPM009082,"Euphyia intermediata","Sharp-angled Carpet",Iowa,Clayton,2007-06-28,,"Fern Ridge Fish and Wildlife Service",42.84298,-91.36977,"Jim Durbin",adult,Blacklight/Fluorescent,Pinned,1,,,,,,,,,
27087,"Jim Durbin Drawer 072",2014-027440,SPM009113,"Euphyia intermediata","Sharp-angled Carpet",Iowa,Linn,2007-07-26,,"J. Harold Ennis County Park",41.898468,-91.482841,"Jim Durbin",adult,Blacklight/Fluorescent,Pinned,1,,,,,,,,,
27088,"Jim Durbin Drawer 072",2014-027441,SPM009370,"Euphyia intermediata","Sharp-angled Carpet",Iowa,Linn,2007-08-21,,"Wickiup Hill Outdoor Learning Area",42.08398,-91.7651,"Jim Durbin",adult,Blacklight/Fluorescent,Pinned,1,,,,,,,,,
27089,"Jim Durbin Drawer 072",2014-027442,SPM011475,"Euphyia intermediata","Sharp-angled Carpet",Iowa,Linn,2008-07-27,,Redacted,Redacted,Redacted,"Jim Durbin",adult,Blacklight/Fluorescent,Pinned,1,,,,,,,,,
27090,"Jim Durbin Drawer 072",2014-027443,SPM011480,"Euphyia intermediata","Sharp-angled Carpet",Iowa,Linn,2008-07-27,,Redacted,Redacted,Redacted,"Jim Durbin",adult,Blacklight/Fluorescent,Pinned,1,,,,,,,,,
27091,"Jim Durbin Drawer 072",2014-027444,SPM011950,"Euphyia intermediata","Sharp-angled Carpet",Iowa,Linn,2008-07-30,,Redacted,Redacted,Redacted,"Jim Durbin",adult,Blacklight/Fluorescent,Pinned,1,,,,,,,,,
27092,"Jim Durbin Drawer 072",2014-027445,SPM012045,"Euphyia intermediata","Sharp-angled Carpet",Iowa,Linn,2008-08-10,,Redacted,Redacted,Redacted,"Jim Durbin",adult,Blacklight/Fluorescent,Pinned,1,,,,,,,,,
27093,"Jim Durbin Drawer 072",2014-027446,SPM012219,"Euphyia intermediata","Sharp-angled Carpet",Iowa,Linn,2008-08-13,,"1460 Douglas Ct, Marion",42.040069,-91.590953,"Jim Durbin",adult,Blacklight/Fluorescent,Pinned,1,,,,,,,,,
27094,"Jim Durbin Drawer 072",2014-027447,SPM012394,"Euphyia intermediata","Sharp-angled Carpet",Iowa,Linn,2008-08-21,,Redacted,Redacted,Redacted,"Jim Durbin",adult,Blacklight/Fluorescent,Pinned,1,,,,,,,,,
27095,"Jim Durbin Drawer 072",2014-027448,SPM012502,"Euphyia intermediata","Sharp-angled Carpet",Iowa,Linn,2008-07-30,,Redacted,Redacted,Redacted,"Jim Durbin",adult,Blacklight/Fluorescent,Pinned,1,,,,,,,,,
27096,"Jim Durbin Drawer 072",2014-027449,SPM012592,"Euphyia intermediata","Sharp-angled Carpet",Iowa,Linn,2008-08-17,,Redacted,Redacted,Redacted,"Jim Durbin",adult,Blacklight/Fluorescent,Pinned,1,,,,,,,,,
27097,"Jim Durbin Drawer 072",2014-027450,SPM013799,"Euphyia intermediata","Sharp-angled Carpet",Iowa,Linn,2009-06-03,,Redacted,Redacted,Redacted,"Jim Durbin",adult,Blacklight/Fluorescent,Pinned,1,,,,,,,,,
27098,"Jim Durbin Drawer 072",2014-027451,SPM013806,"Euphyia intermediata","Sharp-angled Carpet",Iowa,Linn,2009-06-03,,Redacted,Redacted,Redacted,"Jim Durbin",adult,Blacklight/Fluorescent,Pinned,1,,,,,,,,,
27099,"Jim Durbin Drawer 072",2014-027452,SPM013819,"Euphyia intermediata","Sharp-angled Carpet",Iowa,Linn,2009-06-03,,Redacted,Redacted,Redacted,"Jim Durbin",adult,Blacklight/Fluorescent,Pinned,1,,,,,,,,,
27101,"Jim Durbin Drawer 072",2014-027454,SPM014565,"Euphyia intermediata","Sharp-angled Carpet",Iowa,Delaware,2009-07-17,,"Twin Bridges Park - Elk Creek - Trout",42.631218,-91.284601,"Jim Durbin",adult,Blacklight/Fluorescent,Pinned,1,,,,,,,,,
27102,"Jim Durbin Drawer 072",2014-027455,SPM015605,"Euphyia intermediata","Sharp-angled Carpet",Iowa,Linn,2009-08-13,,"Wanatee County Park",42.0094,-91.56623,"Jim Durbin",adult,Blacklight/Fluorescent,Pinned,1,,,,,,,,,
27103,,2014-027456,SPM016008,"Euphyia intermediata","Sharp-angled Carpet",Iowa,Linn,2006-04-18,,"Wickiup Hill Outdoor Learning Area",42.08398,-91.7651,"Frank Olsen",adult,,Pinned,1,,,,,,,,,"Located at Iowa State"
27104,,2014-027457,SPM017186,"Euphyia intermediata","Sharp-angled Carpet",Iowa,Allamakee,2009-06-16,,"Heritage Valley",43.37455,-91.589809,"MJ Hatfield",adult,,Pinned,1,,,,,,,,,
27105,"Frank Olsen Drawer 44",2014-027458,SPM020203,"Euphyia intermediata","Sharp-angled Carpet",Iowa,Dubuque,2010-05-19,,"White Pine Hollow State Preserve",42.62803,-91.09843,"Doug Veal",adult,,Pinned,1,,,,,,,,,"Located at Iowa State"
27106,"Frank Olsen Drawer 44",2014-027459,SPM020356,"Euphyia intermediata","Sharp-angled Carpet",Iowa,Linn,2010-05-06,,"Rock Island Botanical State Preserve",42.02732,-91.72723,"Frank Olsen",adult,,Pinned,1,,,,,,,,,"Located at Iowa State"
27107,"Frank Olsen Drawer 44",2014-027460,SPM020517,"Euphyia intermediata","Sharp-angled Carpet",Iowa,Linn,2010-08-06,,"Wickiup Hill Outdoor Learning Area",42.08398,-91.7651,"Frank Olsen",adult,,Pinned,1,,,,,,,,,"Located at Iowa State"
27108,"Frank Olsen Drawer 44",2014-027461,SPM020518,"Euphyia intermediata","Sharp-angled Carpet",Iowa,Clayton,2010-04-29,,"Bixby State Preserve",42.67502,-91.3988,"Frank Olsen",adult,,Pinned,1,,,,,,,,,"Located at Iowa State"
27109,,2014-027462,SPM023203,"Euphyia intermediata","Sharp-angled Carpet",Iowa,Linn,2011-08-06,,"Wanatee County Park",42.0094,-91.56623,"Jim Durbin",adult,Blacklight/Fluorescent,Photograph,1,,,,,,,,,
27110,"Jim Durbin Drawer 072",2014-027463,SPM023571,"Euphyia intermediata","Sharp-angled Carpet",Iowa,Linn,2011-07-23,,"Rock Island Botanical State Preserve",42.02732,-91.72723,"Tom Jantscher",adult,,Pinned,1,,,,,,,,,
27111,"Jim Durbin Drawer 072",2014-027464,SPM023652,"Euphyia intermediata","Sharp-angled Carpet",Iowa,Winneshiek,2011-08-26,,"100 Acre Wood-x",43.431848,-92.009353,"Jim Durbin",adult,Blacklight/Fluorescent,Pinned,1,,,,,,,,,
27112,,2014-027465,SPM023731,"Euphyia intermediata","Sharp-angled Carpet",Iowa,Winneshiek,2011-08-26,,"100 Acre Wood-x",43.431848,-92.009353,"Jim Durbin",adult,Blacklight/Fluorescent,Photograph,1,,,,,,,,,
27116,"Frank Olsen Drawer 44",2014-027469,SPM024919,"Euphyia intermediata","Sharp-angled Carpet",Iowa,Tama,2011-08-11,,"Hickory Hills Park, Tama County",42.2593,-92.3093,"Frank Olsen",adult,,Pinned,1,,,,,,,,,"Located at Iowa State"
27117,,2014-027470,SPM026524,"Euphyia intermediata","Sharp-angled Carpet",Iowa,Linn,2012-05-02,,"Matsell Bridge Natural Area",42.13131,-91.38886,"Jim Durbin",adult,Blacklight/Fluorescent,Photograph,1,,,,,,,,,
27118,,2014-027471,SPM026634,"Euphyia intermediata","Sharp-angled Carpet",Iowa,Linn,2012-05-04,,"Wakpicada Natural Area",42.18892,-91.52035,"Jim Durbin",adult,Blacklight/Fluorescent,Photograph,1,,,,,,,,,
27119,,2014-027472,SPM026881,"Euphyia intermediata","Sharp-angled Carpet",Iowa,Linn,2012-05-06,,"Matsell Bridge Natural Area",42.13131,-91.38886,"Jim Durbin",adult,Blacklight/Fluorescent,Photograph,1,,,,,,,,,
27120,,2014-027473,SPM027208,"Euphyia intermediata","Sharp-angled Carpet",Iowa,Linn,2012-05-18,,"Matsell Bridge Natural Area",42.13131,-91.38886,"Jim Durbin",adult,Blacklight/Fluorescent,Photograph,1,,,,,,,,,
27121,,2014-027474,SPM029990,"Euphyia intermediata","Sharp-angled Carpet",Iowa,Linn,2012-07-05,,"Wakpicada Natural Area",42.18892,-91.52035,"Jim Durbin",adult,Blacklight/Fluorescent,Photograph,1,,,,,,,,,
27122,,2014-027475,SPM030005,"Euphyia intermediata","Sharp-angled Carpet",Iowa,Kossuth,2012-05-03,,"Smith Wildlife Area",43.0245,-94.2107,"Matt Kenne",adult,,Sighting,1,,,,,,,,,
27123,,2014-027476,SPM030138,"Euphyia intermediata","Sharp-angled Carpet",Iowa,Linn,2012-07-08,,"Wanatee County Park",42.0094,-91.56623,"Jim Durbin",adult,Blacklight/Fluorescent,Photograph,1,,,,,,,,,
27124,,2014-027477,SPM030741,"Euphyia intermediata","Sharp-angled Carpet",Iowa,Linn,2012-07-19,,"Wanatee County Park",42.01026,-91.57381,"Jim Durbin",adult,Blacklight/Fluorescent,Photograph,1,,,,,,,,,
27125,,2014-027478,SPM031161,"Euphyia intermediata","Sharp-angled Carpet",Iowa,Linn,2012-07-29,,"Matsell Bridge Natural Area",42.13131,-91.38886,"Jim Durbin",adult,Blacklight/Fluorescent,Photograph,1,,,,,,,,,
27126,,2014-027479,SPM031162,"Euphyia intermediata","Sharp-angled Carpet",Iowa,Linn,2012-07-29,,"Matsell Bridge Natural Area",42.13131,-91.38886,"Jim Durbin",adult,Blacklight/Fluorescent,Photograph,1,,,,,,,,,
27127,,2014-027480,SPM031313,"Euphyia intermediata","Sharp-angled Carpet",Iowa,Linn,2012-08-18,,"Matsell Bridge Natural Area",42.13131,-91.38886,"Jim Durbin",adult,Blacklight/Fluorescent,Photograph,1,,,,,,,,,
27128,,2014-027481,SPM032203,"Euphyia intermediata","Sharp-angled Carpet",Iowa,Johnson,2012-05-15,,"Iowa City",41.667,-91.545,"Mark Brown",adult,,Photograph,1,,,,,,,,,
27129,"Frank Olsen Drawer 44",2014-027482,SPM032318,"Euphyia intermediata","Sharp-angled Carpet",Iowa,Dubuque,2012-07-10,,"Mines of Spain State Recreational Area",42.4453,-90.62293,"Frank Olsen",adult,,Pinned,1,,,,,,,,,"Located at Iowa State"
27130,"Frank Olsen Drawer 44",2014-027483,SPM032554,"Euphyia intermediata","Sharp-angled Carpet",Iowa,Benton,2012-08-22,,"Minne Estema Park",42.257,-92.0198,"Frank Olsen",adult,,Pinned,1,,,,,,,,,"Located at Iowa State"
27131,"Frank Olsen Drawer 44",2014-027484,SPM032555,"Euphyia intermediata","Sharp-angled Carpet",Iowa,Dubuque,2012-08-24,,"Catfish Creek State Preserve",42.4679,-90.6553,"Frank Olsen",adult,,Pinned,1,,,,,,,,,"Located at Iowa State"
27132,"Frank Olsen Drawer 44",2014-027485,SPM032556,"Euphyia intermediata","Sharp-angled Carpet",Iowa,Clayton,2012-08-07,,"Osborne Outdoor Education Center Park",42.79303,-91.4432,"Frank Olsen",adult,,Pinned,1,,,,,,,,,"Located at Iowa State"
27133,"Frank Olsen Drawer 44",2014-027486,SPM032557,"Euphyia intermediata","Sharp-angled Carpet",Iowa,Clayton,2012-08-07,,"Osborne Outdoor Education Center Park",42.79303,-91.4432,"Frank Olsen",adult,,Pinned,1,,,,,,,,,"Located at Iowa State"
27134,"Jim Durbin Drawer 072",2014-027487,SPM036095,"Euphyia intermediata","Sharp-angled Carpet",Iowa,Linn,2013-08-21,,"Matsell Bridge Natural Area",42.13131,-91.38886,"Jim Durbin",adult,Blacklight/Fluorescent,Pinned,1,,,,,,,,,
27135,,2014-027488,SPM036938,"Euphyia intermediata","Sharp-angled Carpet",Iowa,Marshall,2013-08-21,,Redacted,Redacted,Redacted,"Carl Kurtz",adult,,Photograph,1,,,,,,,,,
27136,,2014-027489,SPM037147,"Euphyia intermediata","Sharp-angled Carpet",Iowa,Allamakee,2009-06-20,,"Heritage Valley",43.37455,-91.589809,"MJ Hatfield",adult,,Photograph,1,,,,,,,,,
27137,"Frank Olsen Drawer 44",2014-027490,SPM037243,"Euphyia intermediata","Sharp-angled Carpet",Iowa,"Van Buren",2013-09-18,,"Shimek State Forest, Farmington Unit",40.6659,-91.73637,"Frank Olsen",adult,,Pinned,1,,,,,,,,,"Located at Iowa State"
48815,,2014-049193,SPM034146,"Euphyia intermediata","Sharp-angled Carpet",Iowa,Linn,2013-06-18,,"Matsell Bridge Natural Area",42.13131,-91.38886,"Jim Durbin",adult,Blacklight/Fluorescent,Photograph,1,,,,,,,,,
48868,,2014-049246,SPM040938,"Euphyia intermediata","Sharp-angled Carpet",Iowa,Linn,2014-06-17,,"Pleasant Creek State Recreation Area, Linn County",42.10948,-91.8249,"Jim Durbin",adult,Blacklight/Fluorescent,Photograph,1,,,,,,,,,
50032,,2014-050414,,"Euphyia intermediata","Sharp-angled Carpet",Iowa,Linn,2014-08-18,2030-2300DST,"Wanatee County Park",42.01007,-91.566739,"Jim Durbin",adult,Blacklight/Fluorescent,Photograph,1,77-74,75-86,68,,,29.73,Clear,,
66678,,2014-067283,,"Euphyia intermediata","Sharp-angled Carpet",Iowa,Winneshiek,2011-08-26,,"100 Acre Wood-x",0,0,"MJ Hatfield",adult,,Photograph,1,,,,,,,,,
66939,,2014-067544,,"Euphyia intermediata","Sharp-angled Carpet",Iowa,Winneshiek,2011-08-02,,"100 Acre Wood-x",0,0,"MJ Hatfield",adult,,Photograph,1,,,,,,,,,
69081,,2014-069688,,"Euphyia intermediata","Sharp-angled Carpet",Iowa,Allamakee,2009-06-20,,"Heritage Valley",43.37455,-91.589809,"Moni Hayne",adult,Blacklight/Fluorescent,Sighting,1,,,,,,,,,
71855,"Frank Olsen Drawer 44",2014-072462,,"Euphyia intermediata","Sharp-angled Carpet",Iowa,Linn,2014-07-21,,"Pleasant Creek State Recreation Area, Linn County",42.110327,-91.822988,"Frank Olsen",adult,,Pinned,1,,,,,,,,,"Located at Iowa State"
108203,,2014-108950,,"Euphyia intermediata","Sharp-angled Carpet",Iowa,Boone,2014-05-24,,"Building Hwy R18",42.0316667,-93.9502778,"Tom Jantscher",adult,,Photograph,1,52,,,0,,," hazy clouds",,"Edge of woods in bottom of Des Moines River valley"
120780,"Frank Olsen Drawer 44",2015-011164,,"Euphyia intermediata","Sharp-angled Carpet",Iowa,Linn,2006-04-18,,"Wickiup Hill Outdoor Learning Area",42.08398,-91.7651,"Frank Olsen",adult,,Pinned,1,,,,,,,,,"Located at Iowa State"
126972,,2015-017534,,"Euphyia intermediata","Sharp-angled Carpet",Iowa,Linn,2015-06-16,"2100 to 2300","Wickiup Hill Outdoor Learning Area",42.087567,-91.767578,"Jim Durbin",adult,Blacklight/Fluorescent,Photograph,1,72,65,60,1,90,30.02,clear,"0% visible",
128454,,2015-019044,,"Euphyia intermediata","Sharp-angled Carpet",Iowa,Linn,2015-07-26,"2100 to 2300","Matsell Bridge Natural Area",42.131959,-91.388307,"Jim Durbin",adult,Blacklight/Fluorescent,Photograph,1,75,95,73,2,160,29.92,"partly cloudy","60% visible",
129136,,2015-019726,,"Euphyia intermediata","Sharp-angled Carpet",Iowa,Linn,2015-08-03,"2045 - 2300","Matsell Bridge Natural Area",42.131959,-91.388307,"Jim Durbin",adult,Blacklight/Fluorescent,Photograph,1,72,78,58,5,270,29.92,Clear,"90% visible",
129457,"Jim Durbin Drawer 072",2015-020047,,"Euphyia intermediata","Sharp-angled Carpet",Iowa,Linn,2015-08-21,2030-2230,"Indian Creek Nature Center",41.968932,-91.586884,"Jim Durbin",adult,Blacklight/Fluorescent,Pinned,1,73,61,58,4,160,29.95,clear,"30% visible",
133108,"Frank Olsen Drawer 44",2015-023702,,"Euphyia intermediata","Sharp-angled Carpet",Iowa,Jones,2015-06-04,,"Hamilton and Tapken Prairie Preserve",42.1775,-90.9975,"Frank Olsen",adult,,Pinned,1,,,,,,,,,"Located at Iowa State"
133109,"Frank Olsen Drawer 44",2015-023703,,"Euphyia intermediata","Sharp-angled Carpet",Iowa,Appanoose,2015-08-07,,"Sharon Bluffs State Park",40.72057,-92.80018,"Frank Olsen",adult,,Pinned,1,,,,,,,,,"Located at Iowa State"
145257,,2016-009878,,"Euphyia intermediata","Sharp-angled Carpet",Iowa,Allamakee,2015-05-06,,Redacted,Redacted,Redacted,"Kyle E. Johnson",adult,,,1,68,,,,,," mostly cloudy/light wind, showers prior",,"ridgeline dry-mesic Quercus-Carya deciduous woodland overlooking bluff prairie and river course"
145995,,2016-010622,,"Euphyia intermediata","Sharp-angled Carpet",Iowa,Allamakee,2015-06-21,,Redacted,Redacted,Redacted,"MJ Hatfield",adult,,Photograph,1,,,,,,,,,
146322,,2016-010949,,"Euphyia intermediata","Sharp-angled Carpet",Iowa,Winneshiek,2014-08-22,,"100 Acre Wood-x",0,0,"MJ Hatfield",adult,,Photograph,1,,,,,,,,,
146494,,2016-011121,,"Euphyia intermediata","Sharp-angled Carpet",Iowa,Winneshiek,2015-06-02,,"100 Acre Wood-x",0,0,"MJ Hatfield",adult,,Photograph,1,,,,,,,,,
146557,,2016-011184,,"Euphyia intermediata","Sharp-angled Carpet",Iowa,Winneshiek,2015-06-07,,"100 Acre Wood-x",0,0,"MJ Hatfield",adult,,Photograph,1,,,,,,,,,
146589,,2016-011216,,"Euphyia intermediata","Sharp-angled Carpet",Iowa,Winneshiek,2015-06-07,,"100 Acre Wood-x",0,0,"MJ Hatfield",adult,,Photograph,1,,,,,,,,,
146590,,2016-011217,,"Euphyia intermediata","Sharp-angled Carpet",Iowa,Winneshiek,2015-06-07,,"100 Acre Wood-x",0,0,"MJ Hatfield",adult,,Photograph,1,,,,,,,,,
147758,,2016-012385,,"Euphyia intermediata","Sharp-angled Carpet",Iowa,Winneshiek,2015-08-09,,"100 Acre Wood-x",0,0,"MJ Hatfield",adult,,Photograph,1,,,,,,,,,
166470,,2016-031215,,"Euphyia intermediata","Sharp-angled Carpet",Iowa,Winneshiek,2015-08-21,,"100 Acre Wood-x",0,0,"MJ Hatfield",adult,,Photograph,1,,,,,,,,,
167061,,2016-031806,,"Euphyia intermediata","Sharp-angled Carpet",Iowa,Linn,2016-05-19,,"Hitaga Sand Ridge Prairie Preserve",42.250957,-91.632098,"Jim Durbin",adult,Blacklight/Florescent,Photograph,1,59,63,46,0,110,30.06,Clear,"95% visible",
167198,,2016-031943,,"Euphyia intermediata","Sharp-angled Carpet",Iowa,Linn,2016-05-23,2030-2300,"Matsell Bridge Natural Area",42.131126,-91.388999,"Jim Durbin",adult,Blacklight/Florescent,Photograph,1,74,42,50,7,130,29.82,clear,Full,