ID,"Collection / Source","Catalog Number","Specify Number",Taxon,"Common Name",State,County,Date,Time,Locale,Latitude,Longitude,Collector,"Life Stage","Collection Method","Preparation Type",Count,Temperature,Humidity,"Dew Point",Wind,"Wind Direction","Barometric Pressure",Sky,"Moon Phase",Notes
42131,"Jim Durbin Drawer 352",2014-042508,SPM001315,"Phymata americana","Jagged Ambush Bug",Kentucky,Daviess,2001-10-20,,"Panther Creek Park",37.71538,-87.21873,"Jim Durbin",adult,Net,Pinned,1,,,,,,,,,
176067,,2016-040817,,"Phymata americana","Jagged Ambush Bug",Iowa,Linn,2016-08-31,,"Hitaga Sand Ridge Prairie Preserve",42.24944,-91.63056,"Jim Durbin",adult,Blacklight/Fluorescent,Photograph,1,,,,,,,,,
176068,,2016-040818,,"Phymata americana","Jagged Ambush Bug",Iowa,Linn,2016-08-31,,"Hitaga Sand Ridge Prairie Preserve",42.24944,-91.63056,"Jim Durbin",adult,Blacklight/Fluorescent,Photograph,1,,,,,,,,,
176072,,2016-040822,,"Phymata americana","Jagged Ambush Bug",Iowa,Linn,2016-08-31,,"Hitaga Sand Ridge Prairie Preserve",42.24944,-91.63056,"Jim Durbin",adult,Blacklight/Fluorescent,Photograph,1,,,,,,,,,
176075,,2016-040825,,"Phymata americana","Jagged Ambush Bug",Iowa,Linn,2016-08-31,,"Hitaga Sand Ridge Prairie Preserve",42.24944,-91.63056,"Jim Durbin",adult,Blacklight/Fluorescent,Photograph,1,,,,,,,,,
176076,,2016-040826,,"Phymata americana","Jagged Ambush Bug",Iowa,Linn,2016-08-31,,"Hitaga Sand Ridge Prairie Preserve",42.24944,-91.63056,"Jim Durbin",adult,Blacklight/Fluorescent,Photograph,1,,,,,,,,,
176077,,2016-040827,,"Phymata americana","Jagged Ambush Bug",Iowa,Linn,2016-08-31,,"Hitaga Sand Ridge Prairie Preserve",42.24944,-91.63056,"Jim Durbin",adult,Blacklight/Fluorescent,Photograph,1,,,,,,,,,
176082,,2016-040832,,"Phymata americana","Jagged Ambush Bug",Iowa,Linn,2016-08-31,,"Hitaga Sand Ridge Prairie Preserve",42.24944,-91.63056,"Jim Durbin",adult,Blacklight/Fluorescent,Photograph,1,,,,,,,,,
176087,,2016-040837,,"Phymata americana","Jagged Ambush Bug",Iowa,Linn,2016-08-31,,"Hitaga Sand Ridge Prairie Preserve",42.24944,-91.63056,"Jim Durbin",adult,Blacklight/Fluorescent,Photograph,1,,,,,,,,,
176088,,2016-040838,,"Phymata americana","Jagged Ambush Bug",Iowa,Linn,2016-08-31,,"Hitaga Sand Ridge Prairie Preserve",42.24944,-91.63056,"Jim Durbin",adult,Blacklight/Fluorescent,Photograph,1,,,,,,,,,
176094,,2016-040844,,"Phymata americana","Jagged Ambush Bug",Iowa,Linn,2016-08-31,,"Hitaga Sand Ridge Prairie Preserve",42.24944,-91.63056,"Jim Durbin",adult,Blacklight/Fluorescent,Photograph,1,,,,,,,,,
176095,,2016-040845,,"Phymata americana","Jagged Ambush Bug",Iowa,Linn,2016-08-31,,"Hitaga Sand Ridge Prairie Preserve",42.24944,-91.63056,"Jim Durbin",adult,Blacklight/Fluorescent,Photograph,1,,,,,,,,,
176098,,2016-040848,,"Phymata americana","Jagged Ambush Bug",Iowa,Linn,2016-08-31,,"Hitaga Sand Ridge Prairie Preserve",42.24944,-91.63056,"Jim Durbin",adult,Blacklight/Fluorescent,Photograph,1,,,,,,,,,
176116,,2016-040866,,"Phymata americana","Jagged Ambush Bug",Iowa,Linn,2016-08-18,,"Hitaga Sand Ridge Prairie Preserve",42.24949,-91.63038,"Don F. Becker",adult,Sighting,Photograph,1,,,,,,,,,
176118,,2016-040868,,"Phymata americana","Jagged Ambush Bug",Iowa,Linn,2016-08-20,,"Pinicon Ridge Park",42.21028,-91.54417,"Don F. Becker",adult,,Photograph,1,,,,,,,,,
176123,,2016-040873,,"Phymata americana","Jagged Ambush Bug",Iowa,Linn,2016-08-20,,"Pinicon Ridge Park",42.21028,-91.54417,"Don F. Becker",adult,,Photograph,1,,,,,,,,,
176136,,2016-040886,,"Phymata americana","Jagged Ambush Bug",Iowa,Linn,2016-08-20,,"Pinicon Ridge Park",42.21028,-91.54417,"Don F. Becker",adult,,Photograph,1,,,,,,,,,
176137,,2016-040887,,"Phymata americana","Jagged Ambush Bug",Iowa,Linn,2016-08-20,,"Pinicon Ridge Park",42.21028,-91.54417,"Don F. Becker",adult,,Photograph,1,,,,,,,,,
176139,,2016-040889,,"Phymata americana","Jagged Ambush Bug",Iowa,Linn,2016-08-20,,"Pinicon Ridge Park",42.21028,-91.54417,"Don F. Becker",adult,,Photograph,1,,,,,,,,,
176140,,2016-040890,,"Phymata americana","Jagged Ambush Bug",Iowa,Linn,2016-08-20,,"Pinicon Ridge Park",42.21028,-91.54417,"Don F. Becker",adult,,Photograph,1,,,,,,,,,
176141,,2016-040891,,"Phymata americana","Jagged Ambush Bug",Iowa,Linn,2016-08-20,,"Pinicon Ridge Park",42.21028,-91.54417,"Don F. Becker",adult,,Photograph,1,,,,,,,,,
176143,,2016-040893,,"Phymata americana","Jagged Ambush Bug",Iowa,Linn,2016-08-20,,"Pinicon Ridge Park",42.21028,-91.54417,"Don F. Becker",adult,,Photograph,1,,,,,,,,,
176146,,2016-040896,,"Phymata americana","Jagged Ambush Bug",Iowa,Linn,2016-08-20,,"Pinicon Ridge Park",42.21028,-91.54417,"Don F. Becker",adult,,Photograph,1,,,,,,,,,
176147,,2016-040897,,"Phymata americana","Jagged Ambush Bug",Iowa,Linn,2016-08-20,,"Pinicon Ridge Park",42.21028,-91.54417,"Don F. Becker",adult,,Photograph,1,,,,,,,,,
176149,,2016-040899,,"Phymata americana","Jagged Ambush Bug",Iowa,Linn,2016-08-22,,"Matsell Bridge Natural Area",42.1380556,-91.3944444,"Don F. Becker",adult,,Photograph,1,,,,,,,,,
176154,,2016-040904,,"Phymata americana","Jagged Ambush Bug",Iowa,Linn,2016-08-22,,"Matsell Bridge Natural Area",42.1380556,-91.3944444,"Don F. Becker",adult,,Photograph,1,,,,,,,,,
176156,,2016-040906,,"Phymata americana","Jagged Ambush Bug",Iowa,Linn,2016-08-22,,"Matsell Bridge Natural Area",42.1380556,-91.3944444,"Don F. Becker",adult,,Photograph,1,,,,,,,,,
176359,,2016-041109,,"Phymata americana","Jagged Ambush Bug",Iowa,Jones,2016-09-04,,"Westphal Timber, Jones",42.1349,-90.95348,"Jim Durbin",adult,Blacklight/Fluorescent,Photograph,1,,,,,,,,,
176790,,2016-041540,,"Phymata americana","Jagged Ambush Bug",Iowa,Linn,2016-09-18,,"Junction of Hagerman Rd & Otter Rd",42.124163,-91.717742,"Don F. Becker",adult,,Photograph,1,,,,,,,,,
177270,,2016-042020,,"Phymata americana","Jagged Ambush Bug",Iowa,Linn,2016-08-19,,"Hitaga Sand Ridge Prairie Preserve",42.250957,-91.632098,"Don F. Becker",adult,,Photograph,2,,,,,,,,,
177271,,2016-042021,,"Phymata americana","Jagged Ambush Bug",Iowa,Linn,2016-08-21,,"Hitaga Sand Ridge Prairie Preserve",42.250957,-91.632098,"Don F. Becker",adult,,Photograph,1,,,,,,,,,
177276,,2016-042026,,"Phymata americana","Jagged Ambush Bug",Iowa,Jones,2016-08-28,,"Marsh, 3.5 miles west of Onslow",42.105248,-91.084573,"Don F. Becker",adult,,Photograph,1,,,,,,,,,
177277,,2016-042027,,"Phymata americana","Jagged Ambush Bug",Iowa,Jones,2016-08-28,,"Marsh, 3.5 miles west of Onslow",42.105248,-91.084573,"Don F. Becker",adult,,Photograph,1,,,,,,,,,
177280,,2016-042030,,"Phymata americana","Jagged Ambush Bug",Iowa,Jones,2016-08-31,,"Indian Bluffs Wildlife Management Area",42.218938,-91.070555,"Don F. Becker",adult,,Photograph,1,,,,,,,,,
183345,,2017-001306,,"Phymata americana","Jagged Ambush Bug",Iowa,Linn,2016-08-26,,"Hitaga Sand Ridge Prairie Preserve",42.250957,-91.632098,"Jim Durbin",adult,Blacklight/Fluorescent,Photograph,1,,,,,,,,,
183346,,2017-001307,,"Phymata americana","Jagged Ambush Bug",Iowa,Linn,2016-08-26,,"Hitaga Sand Ridge Prairie Preserve",42.250957,-91.632098,"Jim Durbin",adult,Blacklight/Fluorescent,Photograph,1,,,,,,,,,
183350,,2017-001311,,"Phymata americana","Jagged Ambush Bug",Iowa,Linn,2016-08-26,,"Hitaga Sand Ridge Prairie Preserve",42.250957,-91.632098,"Jim Durbin",adult,Blacklight/Fluorescent,Photograph,1,,,,,,,,,
183351,,2017-001312,,"Phymata americana","Jagged Ambush Bug",Iowa,Linn,2016-08-26,,"Hitaga Sand Ridge Prairie Preserve",42.250957,-91.632098,"Jim Durbin",adult,Blacklight/Fluorescent,Photograph,1,,,,,,,,,
183354,,2017-001315,,"Phymata americana","Jagged Ambush Bug",Iowa,Linn,2016-08-26,,"Hitaga Sand Ridge Prairie Preserve",42.250957,-91.632098,"Jim Durbin",adult,Blacklight/Fluorescent,Photograph,1,,,,,,,,,
183355,,2017-001316,,"Phymata americana","Jagged Ambush Bug",Iowa,Linn,2016-08-26,,"Hitaga Sand Ridge Prairie Preserve",42.250957,-91.632098,"Jim Durbin",adult,Blacklight/Fluorescent,Photograph,1,,,,,,,,,
183359,,2017-001320,,"Phymata americana","Jagged Ambush Bug",Iowa,Linn,2016-08-26,,"Hitaga Sand Ridge Prairie Preserve",42.250957,-91.632098,"Jim Durbin",adult,Blacklight/Fluorescent,Photograph,1,,,,,,,,,
183364,,2017-001325,,"Phymata americana","Jagged Ambush Bug",Iowa,Linn,2016-08-26,,"Hitaga Sand Ridge Prairie Preserve",42.250957,-91.632098,"Jim Durbin",adult,Blacklight/Fluorescent,Photograph,1,,,,,,,,,
183365,,2017-001326,,"Phymata americana","Jagged Ambush Bug",Iowa,Linn,2016-08-26,,"Hitaga Sand Ridge Prairie Preserve",42.250957,-91.632098,"Jim Durbin",adult,Blacklight/Fluorescent,Photograph,1,,,,,,,,,
183371,,2017-001332,,"Phymata americana","Jagged Ambush Bug",Iowa,Linn,2016-08-26,,"Hitaga Sand Ridge Prairie Preserve",42.250957,-91.632098,"Jim Durbin",adult,Blacklight/Fluorescent,Photograph,1,,,,,,,,,
183372,,2017-001333,,"Phymata americana","Jagged Ambush Bug",Iowa,Linn,2016-08-26,,"Hitaga Sand Ridge Prairie Preserve",42.250957,-91.632098,"Jim Durbin",adult,Blacklight/Fluorescent,Photograph,1,,,,,,,,,
183375,,2017-001336,,"Phymata americana","Jagged Ambush Bug",Iowa,Linn,2016-08-26,,"Hitaga Sand Ridge Prairie Preserve",42.250957,-91.632098,"Jim Durbin",adult,Blacklight/Fluorescent,Photograph,1,,,,,,,,,
184927,,2017-002889,,"Phymata americana","Jagged Ambush Bug",Iowa,Jefferson,2016-07-27,,"Jefferson County Park",40.98639,-91.99111,"Moni Hayne",adult,,Photograph,1,,,,,,,,,
185919,,2017-003881,,"Phymata americana","Jagged Ambush Bug",Iowa,Linn,2008-08-15,,"Wanatee County Park",42.0125585,-91.569184,"Jim Durbin",adult,Blacklight/Fluorescent,Photograph,1,,,,,,,,,
194865,,2017-012829,,"Phymata americana","Jagged Ambush Bug",Iowa,Linn,2017-07-30,,"1460 Douglas Ct, Marion",42.040069,-91.590953,"Jim Durbin",adult,Blacklight/Fluorescent,Photograph,1,,,,,,,,,
202123,,2018-000269,,"Phymata americana","Jagged Ambush Bug",Iowa,Story,2011-07-30,,"Doolittle Prairie State Preserve",42.148521,-93.589636,"Stephen Cresswell",adult,,Photograph,1,,,,,,,,,
202399,,2018-000545,,"Phymata americana","Jagged Ambush Bug",Iowa,Johnson,2011-08-27,,Coralville,41.6822756,-91.5960643,"Darren McNabb",adult,,Photograph,1,,,,,,,,,
202483,,2018-000629,,"Phymata americana","Jagged Ambush Bug",Iowa,Scott,2013-09-02,,Davenport,41.5278,-90.5844," Moeatiowavoice",adult,,Photograph,1,,,,,,,,,
215119,,2018-013275,,"Phymata americana","Jagged Ambush Bug",Iowa,Linn,2018-07-15,,"1460 Douglas Ct, Marion",42.040069,-91.590953,"Jim Durbin",adult,Blacklight/Fluorescent,Photograph,1,,,,,,,,,
215120,,2018-013276,,"Phymata americana","Jagged Ambush Bug",Iowa,Linn,2018-07-15,,"1460 Douglas Ct, Marion",42.040069,-91.590953,"Jim Durbin",adult,Blacklight/Fluorescent,Photograph,1,,,,,,,,,
215121,,2018-013277,,"Phymata americana","Jagged Ambush Bug",Iowa,Linn,2018-07-15,,"1460 Douglas Ct, Marion",42.040069,-91.590953,"Jim Durbin",adult,Blacklight/Fluorescent,Photograph,1,,,,,,,,,
215123,,2018-013279,,"Phymata americana","Jagged Ambush Bug",Iowa,Linn,2018-07-15,,"1460 Douglas Ct, Marion",42.040069,-91.590953,"Jim Durbin",adult,Blacklight/Fluorescent,Photograph,1,,,,,,,,,
215125,,2018-013281,,"Phymata americana","Jagged Ambush Bug",Iowa,Linn,2018-07-15,,"1460 Douglas Ct, Marion",42.040069,-91.590953,"Jim Durbin",adult,Blacklight/Fluorescent,Photograph,1,,,,,,,,,
215131,,2018-013287,,"Phymata americana","Jagged Ambush Bug",Iowa,Linn,2018-07-15,,"1460 Douglas Ct, Marion",42.040069,-91.590953,"Jim Durbin",adult,Blacklight/Fluorescent,Photograph,1,,,,,,,,,
215143,,2018-013299,,"Phymata americana","Jagged Ambush Bug",Iowa,Linn,2018-07-17,,"1460 Douglas Ct, Marion",42.040069,-91.590953,"Jim Durbin",adult,Blacklight/Fluorescent,Photograph,1,,,,,,,,,
218688,,2018-016844,,"Phymata americana","Jagged Ambush Bug",Iowa,Linn,2018-08-10,,"Hitaga Sand Ridge Prairie Preserve",42.249489,-91.629911,"Jim Durbin",adult,Blacklight/Fluorescent,Photograph,1,,,,,,,,,
218728,,2018-016884,,"Phymata americana","Jagged Ambush Bug",Iowa,Jackson,2018-08-13,,"Near St Donatus-x",42.3615,-90.576982,"Don F. Becker",adult,,Photograph,1,,,,,,,,,
219651,,2018-018078,,"Phymata americana","Jagged Ambush Bug",Iowa,Jackson,2018-08-13,,"Ozark Wildlife Area",42.195167,-90.853079,"Don F. Becker",adult,,Photograph,1,,,,,,,,,
229778,,2019-004492,,"Phymata americana","Jagged Ambush Bug",Iowa,Jefferson,2018-07-19,,"Near Fairfield",41.0503,-92.024,"Moni Hayne",adult,,Photograph,1,,,,,,,,,
229799,,2019-004513,,"Phymata americana","Jagged Ambush Bug",Iowa,Jefferson,2018-07-24,,"Near Fairfield",41.0503,-92.024,"Moni Hayne",adult,,Photograph,1,,,,,,,,,
229827,,2019-004541,,"Phymata americana","Jagged Ambush Bug",Iowa,Jefferson,2018-07-25,,"Jefferson County Park",40.98639,-91.99111,"Moni Hayne",adult,,Photograph,1,,,,,,,,,
234905,,,,"Phymata americana","Jagged Ambush Bug",Iowa,Linn,2019-08-01,,"Wickiup Hill Outdoor Learning Area",42.08878,-91.767089,"Jim Durbin",adult,Sighting,Photograph,1,,,,,,,,,
236722,,,,"Phymata americana","Jagged Ambush Bug",Minnesota,Washington,2019-08-23,18:47:51,"St. Croix Beach Public Riverfront Park",44.92092,-92.764049,"Don F. Becker",adult,Sighting,Photograph,1,,,,,,,,,
236726,,,,"Phymata americana","Jagged Ambush Bug",Iowa,Howard,2019-08-25,12:34:16,"Along Dvorak Memorial Hwy-x",43.49020865,-92.13203577,"Don F. Becker",adult,Sighting,Photograph,1,,,,,,,,,
236737,,,,"Phymata americana","Jagged Ambush Bug",Iowa,"Black Hawk",2019-08-25,14:37:21,"Crane Creek County Park",42.5929696,-92.21918593,"Don F. Becker",adult,Sighting,Photograph,1,,,,,,,,,
236738,,,,"Phymata americana","Jagged Ambush Bug",Iowa,Bremer,2019-08-25,14:07:36,"Junction of 230th St and Viking Ave",42.71922785,-92.14079995,"Don F. Becker",adult,Sighting,Photograph,1,,,,,,,,,
236739,,,,"Phymata americana","Jagged Ambush Bug",Iowa,Chickasaw,2019-08-25,13:41:46,"Junction of 250th St and Union Ave",42.99493994,-92.14108412,"Don F. Becker",,,Photograph,1,,,,,,,,,
236742,,,,"Phymata americana","Jagged Ambush Bug",Iowa,Chickasaw,2019-08-25,13:17:10,"Junction of 110th St and Union Ave",43.20275826,-92.14115148,"Don F. Becker",adult,Sighting,Photograph,1,,,,,,,,,
236743,,,,"Phymata americana","Jagged Ambush Bug",Iowa,Howard,2019-08-25,13:11:06,"Junction of Willow Ave and 100th St",43.21462661,-92.12104674,"Don F. Becker",adult,Sighting,Photograph,1,,,,,,,,,
236744,,,,"Phymata americana","Jagged Ambush Bug",Iowa,Howard,2019-08-25,12:57:34,"Junction of Turkey River and Dvorak Memorial Hwy",43.33637192,-92.11996834,"Don F. Becker",adult,Sighting,Photograph,1,,,,,,,,,
236823,,,,"Phymata americana","Jagged Ambush Bug",Iowa,Louisa,2019-09-03,9:46:28,"Big Sand Mound Prairie Preserve, Louisa County",41.32761449,-91.08207773,"Don F. Becker",adult,Sighting,Photograph,1,,,,,,,,,
237585,,,,"Phymata americana","Jagged Ambush Bug",Iowa,Dickinson,2019-08-07,11:39:00,"Cayler Prairie State Preserve",43.395614,-95.249393,"Jeff Moore",adult,Sighting,Photograph,1,,,,,,,,,"Cayler Prairie"
237623,,,,"Phymata americana","Jagged Ambush Bug",Iowa,Linn,2019-09-06,,"Hitaga Sand Ridge Prairie Preserve",42.250429,-91.634637,"Jim Durbin",adult,Sighting,Photograph,1,,,,,,,,,
237625,,,,"Phymata americana","Jagged Ambush Bug",Iowa,Linn,2019-09-06,,"Hitaga Sand Ridge Prairie Preserve",42.250429,-91.634637,"Jim Durbin",adult,Sighting,Photograph,1,,,,,,,,,
237636,,,,"Phymata americana","Jagged Ambush Bug",Iowa,Linn,2019-09-06,,"Hitaga Sand Ridge Prairie Preserve",42.250429,-91.634637,"Jim Durbin",adult,Sighting,Photograph,1,,,,,,,,,
237641,,,,"Phymata americana","Jagged Ambush Bug",Iowa,Linn,2019-09-06,,"Hitaga Sand Ridge Prairie Preserve",42.250429,-91.634637,"Jim Durbin",adult,Sighting,Photograph,1,,,,,,,,,
237643,,,,"Phymata americana","Jagged Ambush Bug",Iowa,Linn,2019-09-06,,"Hitaga Sand Ridge Prairie Preserve",42.250429,-91.634637,"Jim Durbin",adult,Sighting,Photograph,1,,,,,,,,,
237648,,,,"Phymata americana","Jagged Ambush Bug",Iowa,Linn,2019-09-06,,"Hitaga Sand Ridge Prairie Preserve",42.250429,-91.634637,"Jim Durbin",adult,Sighting,Photograph,1,,,,,,,,,
237649,,,,"Phymata americana","Jagged Ambush Bug",Iowa,Linn,2019-09-06,,"Hitaga Sand Ridge Prairie Preserve",42.250429,-91.634637,"Jim Durbin",adult,Sighting,Photograph,1,,,,,,,,,
263908,,,,"Phymata americana","Jagged Ambush Bug",Iowa,Story,2011-07-28,19:57:07,"Doolittle Prairie State Preserve",42.14784,-93.58956,"Moni Hayne",adult,Sighting,Photograph,1,,,,,,,,,
287134,,,,"Phymata americana","Jagged Ambush Bug",Iowa,Jefferson,2018-08-05,8:48:38,"Near Fairfield",41.05202853,-92.02470925,"Moni Hayne",adult,Blacklight/Fluorescent,Pinned,1,,,,,,,,,
287145,,,,"Phymata americana","Jagged Ambush Bug",Iowa,Jefferson,2018-07-28,17:57:54,"Near Fairfield",41.05202853,-92.02470925,"Moni Hayne",adult,Blacklight/Fluorescent,Pinned,1,,,,,,,,,
287149,,,,"Phymata americana","Jagged Ambush Bug",Iowa,Jefferson,2018-07-28,18:14:00,"Near Fairfield",41.05202853,-92.02470925,"Moni Hayne",adult,Blacklight/Fluorescent,Pinned,1,,,,,,,,,
287154,,,,"Phymata americana","Jagged Ambush Bug",Iowa,Jefferson,2018-07-24,18:36:55,"Near Fairfield",41.05202853,-92.02470925,"Moni Hayne",adult,Blacklight/Fluorescent,Pinned,1,,,,,,,,,
287157,,,,"Phymata americana","Jagged Ambush Bug",Iowa,Jefferson,2018-07-23,18:29:40,"Near Fairfield",41.050194,-92.02407,"Moni Hayne",adult,Sighting,Photograph,1,,,,,,,,,
287406,,,,"Phymata americana","Jagged Ambush Bug",Iowa,Cedar,2013-08-06,11:48:59,"Cedar County Conservation",41.76178393,-91.12362149,"Sarah Subbert",adult,Sighting,Photograph,1,,,,,,,,,
301344,,,,"Phymata americana","Jagged Ambush Bug",Iowa,Mitchell,2021-09-04,,"Otranto Park",43.45943,-92.980716,"Jay Gilliam",adult,Sighting,Photograph,1,,,,,,,,,"Otranto Park"
312747,,,,"Phymata americana","Jagged Ambush Bug",Iowa,Linn,2022-07-28,13:52:46,"Wanatee County Park",42.0125597,-91.5706097,"Jim Durbin",adult,Sighting,Photograph,1,,,,,,,,,
312902,,,,"Phymata americana","Jagged Ambush Bug",Iowa,Linn,2022-07-28,13:46:37,"Wanatee County Park",42.01289408,-91.56941857,"Jim Durbin",adult,Sighting,Photograph,1,,,,,,,,,
314020,,,,"Phymata americana","Jagged Ambush Bug",Iowa,Louisa,2022-09-01,8:58:13,"Big Sand Mound Prairie Preserve, Louisa County",41.32089295,-91.08217537,"Don F. Becker",adult,Sighting,Photograph,1,,,,,,,,,
314021,,,,"Phymata americana","Jagged Ambush Bug",Illinois,"Rock Island",2022-09-02,12:40:33,"Indian Island",41.46645056,-90.59802649,"Don F. Becker",adult,Sighting,Photograph,1,,,,,,,,,
314022,,,,"Phymata americana","Jagged Ambush Bug",Illinois,"Rock Island",2022-09-02,12:42:11,"Indian Island",41.46674906,-90.59803945,"Don F. Becker",adult,Sighting,Photograph,1,,,,,,,,,
314024,,,,"Phymata americana","Jagged Ambush Bug",Illinois,"Rock Island",2022-09-02,12:46:58,"Indian Island",41.46708591,-90.59816051,"Don F. Becker",adult,Sighting,Photograph,1,,,,,,,,,
314025,,,,"Phymata americana","Jagged Ambush Bug",Illinois,"Rock Island",2022-09-02,12:51:19,"Indian Island",41.46732809,-90.59826176,"Don F. Becker",adult,Sighting,Photograph,1,,,,,,,,,
314026,,,,"Phymata americana","Jagged Ambush Bug",Illinois,"Rock Island",2022-09-02,12:55:41,"Indian Island",41.46796249,-90.59893894,"Don F. Becker",adult,Sighting,Photograph,1,,,,,,,,,
314028,,,,"Phymata americana","Jagged Ambush Bug",Illinois,Henry,2022-09-04,11:19:41,Geneseo,41.44823216,-90.16101619,"Don F. Becker",adult,Sighting,Photograph,1,,,,,,,,,
314686,,,,"Phymata americana","Jagged Ambush Bug",Iowa,Muscatine,2022-09-15,16:58:06,"Big Sand Mound Prairie Preserve, Muscatine County",41.341241,-91.08836366,"Don F. Becker",adult,Sighting,Photograph,2,,,,,,,,,
316198,,,,"Phymata americana","Jagged Ambush Bug",Iowa,Johnson,2014-08-19,,"Willow Creek/Kiwanis Park",41.647924,-91.569677,"Peter Hansen",adult,Sighting,Photograph,1,,,,,,,,,
316199,,,,"Phymata americana","Jagged Ambush Bug",Iowa,Johnson,2021-09-18,,"Willow Creek/Kiwanis Park",41.647924,-91.569677,"Peter Hansen",adult,Sighting,Photograph,1,,,,,,,,,
319873,,,,"Phymata americana","Jagged Ambush Bug",Iowa,Howard,2022-09-05,,"Hayden Prairie State Wildlife Management Area",43.437447,-92.384944,"Jay Gilliam",adult,Sighting,Photograph,1,,,,,,,,,
336885,,,,"Phymata americana","Jagged Ambush Bug",Iowa,Benton,2023-07-06,11:18:34,"Wildcat Bluff Recreational Area",42.19331874,-91.88041838,"Jim Durbin",adult,Sighting,Photograph,1,,,,,,,,,
336897,,,,"Phymata americana","Jagged Ambush Bug",Iowa,Benton,2023-07-06,11:28:06,"Wildcat Bluff Recreational Area",42.19331874,-91.88041838,"Jim Durbin",adult,Sighting,Photograph,1,,,,,,,,,
336908,,,,"Phymata americana","Jagged Ambush Bug",Iowa,Benton,2023-07-06,11:36:32,"Wildcat Bluff Recreational Area",42.19331874,-91.88041838,"Jim Durbin",adult,Sighting,Photograph,1,,,,,,,,,
336927,,,,"Phymata americana","Jagged Ambush Bug",Iowa,Benton,2023-07-06,11:54:54,"Wildcat Bluff Recreational Area",42.19331874,-91.88041838,"Jim Durbin",adult,Sighting,Photograph,1,,,,,,,,,
336967,,,,"Phymata americana","Jagged Ambush Bug",Iowa,Benton,2023-07-06,10:54:22,"Wildcat Bluff Recreational Area",42.19331874,-91.88041838,"Benton County",adult,Sighting,Photograph,1,,,,,,,,,
336992,,,,"Phymata americana","Jagged Ambush Bug",Iowa,Benton,2023-07-06,11:57:29,"Wildcat Bluff Recreational Area",42.19331874,-91.88041838,"Benton County",adult,Sighting,Photograph,1,,,,,,,,,
337045,,,,"Phymata americana","Jagged Ambush Bug",Iowa,Benton,2023-07-06,11:28:51,"Wildcat Bluff Recreational Area",42.19331874,-91.88041838,"Kenneth Heiar",adult,Sighting,Photograph,1,,,,,,,,,
337705,,,,"Phymata americana","Jagged Ambush Bug",Iowa,Appanoose,2023-07-17,18:05:11,"Cincinnati, Ia",40.62558067,-92.92244763,"Don F. Becker",,,,1,,,,,,,,,
337707,,,,"Phymata americana","Jagged Ambush Bug",Iowa,Appanoose,2023-07-17,18:09:42,"Cincinnati, Ia",40.62565034,-92.92250549,"Don F. Becker",,,,1,,,,,,,,,
337708,,,,"Phymata americana","Jagged Ambush Bug",Iowa,Appanoose,2023-07-17,18:11:27,"Cincinnati, Ia",40.62560371,-92.92253994,"Don F. Becker",adult,Sighting,Photograph,1,,,,,,,,,
338160,,,,"Phymata americana","Jagged Ambush Bug",Iowa,Dallas,2023-07-20,14:44:46,Redacted,Redacted,Redacted,"Jacob Pitzenberger",adult,Sighting,Photograph,1,,,,,,,,,
339310,,,,"Phymata americana","Jagged Ambush Bug",Iowa,Linn,2023-08-03,16:29:23,"1460 Douglas Ct, Marion",42.040088628333,-91.590927941667,"Jim Durbin",adult,Sighting,Photograph,1,,,,,,,,,
339684,,,,"Phymata americana","Jagged Ambush Bug",Iowa,Marshall,2023-08-11,10:57:37,"Marietta Sand Prairie State Preserve",42.09706503,-93.03834482,"Jim Durbin",adult,Sighting,Photograph,1,,,,,,,,,
339686,,,,"Phymata americana","Jagged Ambush Bug",Iowa,Marshall,2023-08-11,10:58:39,"Marietta Sand Prairie State Preserve",42.09706503,-93.03834482,"Jim Durbin",adult,Sighting,Photograph,1,,,,,,,,,
339691,,,,"Phymata americana","Jagged Ambush Bug",Iowa,Muscatine,2023-08-14,17:24:18,"Saulsbury Bridge Recreation Area",41.50290593,-91.17381257,"Don F. Becker",adult,Sighting,Photograph,1,,,,,,,,,
340563,,,,"Phymata americana","Jagged Ambush Bug",Iowa,Louisa,2023-08-26,9:37:43,"Hwy 61 and Iowa River",41.21524672,-91.19839654,"Don F. Becker",adult,Sighting,Photograph,8,,,,,,,,,"8 of them on small patch of golden rod"
340571,,,,"Phymata americana","Jagged Ambush Bug",Iowa,Louisa,2023-08-26,9:58:21,"Hwy 61 and Iowa River",41.21512278,-91.1984316,"Don F. Becker",adult,Sighting,Photograph,1,,,,,,,,,
341200,,,,"Phymata americana","Jagged Ambush Bug",Iowa,Johnson,2023-09-03,14:03:35,"Devonian Fossil Gorge",41.72108587,-91.53201127,"Don F. Becker",adult,Sighting,Photograph,1,,,,,,,,,
344911,,,,"Phymata americana","Jagged Ambush Bug",Iowa,Polk,2023-09-10,,"Saylorville Visitor Center",41.710399,-93.67038,"Jay Gilliam",adult,Sighting,Photograph,1,,,,,,,,,
344945,,,,"Phymata americana","Jagged Ambush Bug",Iowa,Plymouth,2023-09-23,,"Deer Creek Wildlife Management Area",42.718031,-96.511437,"Jay Gilliam",adult,Sighting,Photograph,1,,,,,,,,,
344950,,,,"Phymata americana","Jagged Ambush Bug",Iowa,Marion,2023-09-23,,"Roberts Creek Park",41.42076,-93.052121,"Jay Gilliam",adult,Sighting,Photograph,1,,,,,,,,,