ID,"Collection / Source","Catalog Number","Specify Number",Taxon,"Common Name",State,County,Date,Time,Locale,Latitude,Longitude,Collector,"Life Stage","Collection Method","Preparation Type",Count,Temperature,Humidity,"Dew Point",Wind,"Wind Direction","Barometric Pressure",Sky,"Moon Phase",Notes
43424,"Frank Olsen Drawer 10",2014-043801,SPM002723,"Prolimacodes badia","Skiff Moth",Iowa,Allamakee,2004-07-10,,"Yellow River State Forest",43.1676,-91.254,"Ed Freese",adult,,Pinned,1,,,,,,,,,"Located at Iowa State"
43425,"Frank Olsen Drawer 10",2014-043802,SPM002724,"Prolimacodes badia","Skiff Moth",Iowa,Linn,2003-07-25,,"Wanatee County Park",42.00994,-91.57749,"Frank Olsen",adult,,Pinned,1,,,,,,,,,"Located at Iowa State"
43426,,2014-043803,SPM003487,"Prolimacodes badia","Skiff Moth",Iowa,Jasper,2003-05-15,,"Neal Smith National Wildlife Refuge",41.5678,-93.2675,"Keith Summerville",adult,,Pinned,1,,,,,,,,,
43427,"Jim Durbin Drawer 036",2014-043804,SPM004418,"Prolimacodes badia","Skiff Moth",Kentucky,Ohio,2005-06-06,,"Leon's Farm, Ohio County",37.42033,-86.77023,"Jim Durbin",adult,Blacklight/Fluorescent,Pinned,1,,,,,,,,,
43428,"Jim Durbin Drawer 036",2014-043805,SPM004422,"Prolimacodes badia","Skiff Moth",Kentucky,Ohio,2005-06-06,,"Leon's Farm, Ohio County",37.42033,-86.77023,"Jim Durbin",adult,Blacklight/Fluorescent,Pinned,1,,,,,,,,,
43429,"Jim Durbin Drawer 036",2014-043806,SPM004427,"Prolimacodes badia","Skiff Moth",Kentucky,Ohio,2005-06-06,,"Leon's Farm, Ohio County",37.42033,-86.77023,"Jim Durbin",adult,Blacklight/Fluorescent,Pinned,1,,,,,,,,,
43430,"Jim Durbin Drawer 036",2014-043807,SPM004436,"Prolimacodes badia","Skiff Moth",Kentucky,Ohio,2005-06-06,,"Leon's Farm, Ohio County",37.42033,-86.77023,"Jim Durbin",adult,Blacklight/Fluorescent,Pinned,1,,,,,,,,,
43431,"Jim Durbin Drawer 036",2014-043808,SPM004450,"Prolimacodes badia","Skiff Moth",Kentucky,Ohio,2005-06-06,,"Leon's Farm, Ohio County",37.42033,-86.77023,"Jim Durbin",adult,Blacklight/Fluorescent,Pinned,1,,,,,,,,,
43432,"Jim Durbin Drawer 036",2014-043809,SPM004742,"Prolimacodes badia","Skiff Moth",Iowa,Linn,2005-07-08,,"Pleasant Creek State Recreation Area, Linn County",42.11952,-91.81215,"Jim Durbin",adult,Blacklight/Fluorescent,Pinned,1,,,,,,,,,
43433,"Jim Durbin Drawer 036",2014-043810,SPM004744,"Prolimacodes badia","Skiff Moth",Iowa,Linn,2005-07-08,,"Pleasant Creek State Recreation Area, Linn County",42.11952,-91.81215,"Jim Durbin",adult,Blacklight/Fluorescent,Pinned,1,,,,,,,,,
43434,"Jim Durbin Drawer 036",2014-043811,SPM004746,"Prolimacodes badia","Skiff Moth",Iowa,Linn,2005-07-08,,"Pleasant Creek State Recreation Area, Linn County",42.11952,-91.81215,"Jim Durbin",adult,Blacklight/Fluorescent,Pinned,1,,,,,,,,,
43435,"Frank Olsen Drawer 10",2014-043812,SPM005801,"Prolimacodes badia","Skiff Moth",Iowa,Allamakee,2005-07-09,,"Yellow River State Forest",43.1676,-91.254,"Frank Olsen",adult,,Pinned,1,,,,,,,,,"Located at Iowa State"
43436,"Jim Durbin Drawer 036",2014-043813,SPM006022,"Prolimacodes badia","Skiff Moth",Kentucky,Ohio,2006-05-29,,"Leon's Farm, Ohio County",37.42033,-86.77023,"Jim Durbin",adult,Blacklight/Fluorescent,Pinned,1,,,,,,,,,
43437,"Jim Durbin Drawer 036",2014-043814,SPM006487,"Prolimacodes badia","Skiff Moth",Kentucky,Ohio,2006-05-29,,"Leon's Farm, Ohio County",37.42033,-86.77023,"Jim Durbin",adult,Blacklight/Fluorescent,Pinned,1,,,,,,,,,
43438,"Jim Durbin Drawer 036",2014-043815,SPM006639,"Prolimacodes badia","Skiff Moth",Iowa,Linn,2006-07-02,,"Wanatee County Park",42.0094,-91.56623,"Jim Durbin",adult,Blacklight/Fluorescent,Pinned,1,,,,,,,,,
43439,"Jim Durbin Drawer 036",2014-043816,SPM006784,"Prolimacodes badia","Skiff Moth",Iowa,Linn,2006-07-14,,"Pleasant Creek State Recreation Area, Linn County",42.11952,-91.81215,"Jim Durbin",adult,Blacklight/Fluorescent,Pinned,1,,,,,,,,,
43440,"Frank Olsen Drawer 10",2014-043817,SPM007769,"Prolimacodes badia","Skiff Moth",Iowa,Linn,2006-07-15,,"Palisades Kepler State Park",41.90833,-91.50238,"Frank Olsen",adult,,Pinned,1,,,,,,,,,"Located at Iowa State"
43441,"Jim Durbin Drawer 036",2014-043818,SPM008824,"Prolimacodes badia","Skiff Moth",Iowa,Clayton,2007-06-28,,"Fern Ridge Fish and Wildlife Service",42.84298,-91.36977,"Jim Durbin",adult,Blacklight/Fluorescent,Pinned,1,,,,,,,,,
43442,"Jim Durbin Drawer 036",2014-043819,SPM008859,"Prolimacodes badia","Skiff Moth",Iowa,Clayton,2007-06-28,,"Fern Ridge Fish and Wildlife Service",42.84298,-91.36977,"Jim Durbin",adult,Blacklight/Fluorescent,Pinned,1,,,,,,,,,
43443,"Jim Durbin Drawer 036",2014-043820,SPM008873,"Prolimacodes badia","Skiff Moth",Iowa,Linn,2007-07-07,,"Pinicon Ridge Park",42.21188,-91.54753,"Jim Durbin",adult,Blacklight/Fluorescent,Pinned,1,,,,,,,,,
43444,"Jim Durbin Drawer 036",2014-043821,SPM008896,"Prolimacodes badia","Skiff Moth",Iowa,Linn,2007-07-07,,"Pinicon Ridge Park",42.21188,-91.54753,"Jim Durbin",adult,Blacklight/Fluorescent,Pinned,1,,,,,,,,,
43445,"Jim Durbin Drawer 036",2014-043822,SPM008898,"Prolimacodes badia","Skiff Moth",Iowa,Linn,2007-07-07,,"Pinicon Ridge Park",42.21188,-91.54753,"Jim Durbin",adult,Blacklight/Fluorescent,Pinned,1,,,,,,,,,
43446,"Jim Durbin Drawer 036",2014-043823,SPM008905,"Prolimacodes badia","Skiff Moth",Iowa,Linn,2007-07-07,,"Pinicon Ridge Park",42.21188,-91.54753,"Jim Durbin",adult,Blacklight/Fluorescent,Pinned,1,,,,,,,,,
43447,"Jim Durbin Drawer 036",2014-043824,SPM009061,"Prolimacodes badia","Skiff Moth",Iowa,Clayton,2007-06-28,,"Fern Ridge Fish and Wildlife Service",42.84298,-91.36977,"Jim Durbin",adult,Blacklight/Fluorescent,Pinned,1,,,,,,,,,
43448,"Frank Olsen Drawer 10",2014-043825,SPM010366,"Prolimacodes badia","Skiff Moth",Iowa,Linn,2007-07-07,,"Pinicon Ridge Park",42.21188,-91.54753,"Frank Olsen",adult,,Pinned,1,,,,,,,,,"Located at Iowa State"
43449,"Frank Olsen Drawer 10",2014-043826,SPM010367,"Prolimacodes badia","Skiff Moth",Iowa,Linn,2007-07-08,,"J. Harold Ennis County Park",41.898488,-91.483092,"Frank Olsen",adult,,Pinned,1,,,,,,,,,"Located at Iowa State"
43450,"Jim Durbin Drawer 036",2014-043827,SPM014664,"Prolimacodes badia","Skiff Moth",Iowa,Linn,2009-07-24,,"Wanatee County Park",42.0094,-91.56623,"Jim Durbin",adult,Blacklight/Fluorescent,Pinned,1,,,,,,,,,
43451,"Frank Olsen Drawer 10",2014-043828,SPM016315,"Prolimacodes badia","Skiff Moth",Iowa,Linn,2009-07-15,,"Pinicon Ridge Park",42.21188,-91.54753,"Frank Olsen",adult,,Pinned,1,,,,,,,,,"Located at Iowa State"
43452,"Frank Olsen Drawer 10",2014-043829,SPM024529,"Prolimacodes badia","Skiff Moth",Iowa,"Van Buren",2011-07-20,,"Shimek State Forest, Farmington Unit",40.6659,-91.73637,"Frank Olsen",adult,,Pinned,1,,,,,,,,,"Located at Iowa State"
43453,"Frank Olsen Drawer 10",2014-043830,SPM024530,"Prolimacodes badia","Skiff Moth",Iowa,"Van Buren",2011-07-20,,"Shimek State Forest, Farmington Unit",40.6659,-91.73637,"Frank Olsen",adult,,Pinned,1,,,,,,,,,"Located at Iowa State"
43454,"Frank Olsen Drawer 10",2014-043831,SPM024531,"Prolimacodes badia","Skiff Moth",Iowa,Warren,2011-07-24,,"Woodland Mounds State Preserve",41.34618,-93.4281,"Frank Olsen",adult,,Pinned,1,,,,,,,,,"Located at Iowa State"
43455,"Frank Olsen Drawer 10",2014-043832,SPM024532,"Prolimacodes badia","Skiff Moth",Iowa,Linn,2011-07-17,,"Pinicon Ridge Park",42.21188,-91.54753,"Frank Olsen",adult,,Pinned,1,,,,,,,,,"Located at Iowa State"
43456,"Frank Olsen Drawer 10",2014-043833,SPM024533,"Prolimacodes badia","Skiff Moth",Iowa,Linn,2011-07-17,,"Pinicon Ridge Park",42.21188,-91.54753,"Frank Olsen",adult,,Pinned,1,,,,,,,,,"Located at Iowa State"
43457,,2014-043834,SPM024968,"Prolimacodes badia","Skiff Moth",Iowa,Louisa,2011-09-24,,"Chinkapin Bluffs Recreation Area",41.26778,-91.345,"John Van Der Linden",adult,,Photograph,1,,,,,,,,,
43458,,2014-043835,SPM028511,"Prolimacodes badia","Skiff Moth",Iowa,Linn,2012-06-15,,"Matsell Bridge Natural Area",42.13131,-91.38886,"Jim Durbin",adult,Blacklight/Fluorescent,Photograph,1,,,,,,,,,
43459,,2014-043836,SPM028563,"Prolimacodes badia","Skiff Moth",Iowa,Linn,2012-06-15,,"Matsell Bridge Natural Area",42.13131,-91.38886,"Jim Durbin",adult,Blacklight/Fluorescent,Photograph,1,,,,,,,,,
43460,,2014-043837,SPM028659,"Prolimacodes badia","Skiff Moth",Iowa,Linn,2012-06-15,,"Matsell Bridge Natural Area",42.13131,-91.38886,"Jim Durbin",adult,Blacklight/Fluorescent,Photograph,1,,,,,,,,,
43461,,2014-043838,SPM029595,"Prolimacodes badia","Skiff Moth",Iowa,Linn,2012-06-28,,"Matsell Bridge Natural Area",42.13131,-91.38886,"Jim Durbin",adult,Blacklight/Fluorescent,Photograph,1,,,,,,,,,
43462,"Frank Olsen Drawer 10",2014-043839,SPM032265,"Prolimacodes badia","Skiff Moth",Iowa,Dubuque,2012-07-10,,"Mines of Spain State Recreational Area",42.4453,-90.62293,"Frank Olsen",adult,,Pinned,1,,,,,,,,,"Located at Iowa State"
43463,"Frank Olsen Drawer 10",2014-043840,SPM032266,"Prolimacodes badia","Skiff Moth",Iowa,Dubuque,2012-07-20,,"Catfish Creek State Preserve",42.4679,-90.6553,"Frank Olsen",adult,,Pinned,1,,,,,,,,,"Located at Iowa State"
43464,"Frank Olsen Drawer 10",2014-043841,SPM032267,"Prolimacodes badia","Skiff Moth",Iowa,Dubuque,2012-07-20,,"Catfish Creek State Preserve",42.4679,-90.6553,"Frank Olsen",adult,,Pinned,1,,,,,,,,,"Located at Iowa State"
43465,,2014-043842,SPM032691,"Prolimacodes badia","Skiff Moth",Iowa,Winneshiek,2012-06-22,,"100 Acre Wood-x",0,0,"MJ Hatfield",adult,,Photograph,1,,,,,,,,,
43466,,2014-043843,SPM034564,"Prolimacodes badia","Skiff Moth",Kentucky,Ohio,2013-07-06,,Redacted,Redacted,Redacted,"Jim Durbin",adult,Blacklight/Fluorescent,Photograph,1,,,,,,,,,
43467,,2014-043844,SPM040804,"Prolimacodes badia","Skiff Moth",Iowa,Linn,2014-06-17,,"Pleasant Creek State Recreation Area, Linn County",42.10948,-91.8249,"Jim Durbin",adult,Blacklight/Fluorescent,Photograph,1,,,,,,,,,
43468,,2014-043845,SPM040942,"Prolimacodes badia","Skiff Moth",Iowa,Linn,2014-06-17,,"Pleasant Creek State Recreation Area, Linn County",42.10948,-91.8249,"Jim Durbin",adult,Blacklight/Fluorescent,Photograph,1,,,,,,,,,
43469,,2014-043846,SPM042234,"Prolimacodes badia","Skiff Moth",Iowa,Linn,2014-07-10,,"Pleasant Creek State Recreation Area, Linn County",42.10948,-91.8249,"Jim Durbin",adult,Blacklight/Fluorescent,Photograph,1,,,,,,,,,
67468,,2014-068073,,"Prolimacodes badia","Skiff Moth",Iowa,Winneshiek,2012-06-22,,"100 Acre Wood-x",0,0,"MJ Hatfield",adult,,Photograph,1,,,,,,,,,
67494,,2014-068099,,"Prolimacodes badia","Skiff Moth",Iowa,Winneshiek,2012-06-22,,"100 Acre Wood-x",0,0,"MJ Hatfield",adult,,Photograph,1,,,,,,,,,
71818,"Frank Olsen Drawer 10",2014-072425,,"Prolimacodes badia","Skiff Moth",Iowa,Linn,2014-07-21,,"Pleasant Creek State Recreation Area, Linn County",42.110327,-91.822988,"Frank Olsen",adult,,Pinned,1,,,,,,,,,"Located at Iowa State"
108401,,2014-109148,,"Prolimacodes badia","Skiff Moth",Iowa,Allamakee,2014-07-13,,"Black Hawk Point Wildlife Management Area",43.4555556,-91.28,"Tom Jantscher",adult,,Photograph,1,,,,,,,,,"Rich mature woods within steep bluffs overlooking Mississippi River valley"
127545,,2015-018135,,"Prolimacodes badia","Skiff Moth",Iowa,Linn,2015-06-23,,"Matsell Bridge Natural Area",42.131959,-91.388307,"Jim Durbin",adult,Blacklight/Fluorescent,Photograph,1,,,,,,,,,
127586,,2015-018176,,"Prolimacodes badia","Skiff Moth",Iowa,Linn,2015-06-23,,"Matsell Bridge Natural Area",42.131959,-91.388307,"Jim Durbin",adult,Blacklight/Fluorescent,Photograph,1,,,,,,,,,
127718,,2015-018308,,"Prolimacodes badia","Skiff Moth",Iowa,Johnson,2015-06-27,,"Sugar Bottom Recreational Area",41.759443,-91.562986,"Jim Durbin",adult,Blacklight/Fluorescent,Photograph,1,,,,,,,,,
128135,,2015-018725,,"Prolimacodes badia","Skiff Moth",Iowa,Linn,2015-07-16,2100-2300,"Matsell Bridge Natural Area",42.131959,-91.388307,"Jim Durbin",adult,Blacklight/Fluorescent,Photograph,1,75,100,74,2,190,29.74,"partly cloudy",Dark,
128273,,2015-018863,,"Prolimacodes badia","Skiff Moth",Iowa,Linn,2015-07-19,"2100 - 2300","Indian Creek Nature Center",41.968932,-91.586884,"Jim Durbin",adult,Blacklight/Fluorescent,Photograph,1,79,62,64,0,0,29.87,clear,"5 % visible",
133432,"Paul Martsching Collection",2015-024026,,"Prolimacodes badia","Skiff Moth",Iowa,Story,2005-07-09,,"Ames, Paul",42.02064,-93.623952,"Paul Martsching",adult,"Building Light",Pinned,1,,,,,,,,,
133433,"Paul Martsching Collection",2015-024027,,"Prolimacodes badia","Skiff Moth",Iowa,Story,2006-06-29,,"Ames, Paul",42.02064,-93.623952,"Paul Martsching",adult,"Building Light",Pinned,1,,,,,,,,,
171608,,2016-036353,,"Prolimacodes badia","Skiff Moth",Iowa,Linn,2016-07-09,2100-2330,"Hitaga Sand Ridge Prairie Preserve",42.250957,-91.632098,"Jim Durbin",adult,Blacklight/Fluorescent,Photograph,1,72,83,66,0,0,30.01,clear,"30% visible",
176071,,2016-040821,,"Prolimacodes badia","Skiff Moth",Iowa,Linn,2016-08-31,,"Hitaga Sand Ridge Prairie Preserve",42.24944,-91.63056,"Jim Durbin",adult,Blacklight/Fluorescent,Photograph,1,,,,,,,,,
183349,,2017-001310,,"Prolimacodes badia","Skiff Moth",Iowa,Linn,2016-08-26,,"Hitaga Sand Ridge Prairie Preserve",42.250957,-91.632098,"Jim Durbin",adult,Blacklight/Fluorescent,Photograph,1,,,,,,,,,
192581,,2017-010542,,"Prolimacodes badia","Skiff Moth",Iowa,Linn,2017-06-14,2100-2330,"Wickiup Hill Outdoor Learning Area",42.087567,-91.767578,"Jim Durbin",adult,Blacklight/Fluorescent,Photograph,1,80,73,71,3,120,29.75,cloudy,"90% visible",
192947,,2017-010912,,"Prolimacodes badia","Skiff Moth",Iowa,Linn,2017-07-01,,"Hitaga Sand Ridge Prairie Preserve",42.250957,-91.632098,"Jim Durbin",adult,Blacklight/Fluorescent,Photograph,1,72,56,55,280,9,29.97,clear,,
192956,,2017-010921,,"Prolimacodes badia","Skiff Moth",Iowa,Linn,2017-07-01,,"Hitaga Sand Ridge Prairie Preserve",42.250957,-91.632098,"Jim Durbin",adult,Blacklight/Fluorescent,Photograph,1,72,56,55,280,9,29.97,clear,,
192974,,2017-010939,,"Prolimacodes badia","Skiff Moth",Iowa,Linn,2017-07-01,,"Hitaga Sand Ridge Prairie Preserve",42.250957,-91.632098,"Jim Durbin",adult,Blacklight/Fluorescent,Photograph,1,72,56,55,280,9,29.97,clear,,
193020,,2017-010985,,"Prolimacodes badia","Skiff Moth",Iowa,Linn,2017-07-01,,"Hitaga Sand Ridge Prairie Preserve",42.250957,-91.632098,"Jim Durbin",adult,Blacklight/Fluorescent,Photograph,1,72,56,55,280,9,29.97,clear,,
193024,,2017-010989,,"Prolimacodes badia","Skiff Moth",Iowa,Linn,2017-07-01,,"Hitaga Sand Ridge Prairie Preserve",42.250957,-91.632098,"Jim Durbin",adult,Blacklight/Fluorescent,Photograph,1,72,56,55,280,9,29.97,clear,,
193297,,2017-011262,,"Prolimacodes badia","Skiff Moth",Iowa,Linn,2017-07-04,,"Wickiup Hill Outdoor Learning Area",42.087358,-91.767092,"Jim Durbin",adult,Blacklight/Fluorescent,Photograph,1,78,78,71,3,90,30.02,"partly cloudy","80% visible",
193444,,2017-011409,,"Prolimacodes badia","Skiff Moth",Iowa,Linn,2017-07-04,,"Wickiup Hill Outdoor Learning Area",42.087358,-91.767092,"Jim Durbin",adult,Blacklight/Fluorescent,Photograph,1,78,78,71,3,90,30.02,"partly cloudy","80% visible",
193475,,2017-011440,,"Prolimacodes badia","Skiff Moth",Iowa,Linn,2017-07-04,,"Wickiup Hill Outdoor Learning Area",42.087358,-91.767092,"Jim Durbin",adult,Blacklight/Fluorescent,Photograph,1,78,78,71,3,90,30.02,"partly cloudy","80% visible",
193545,,2017-011535,,"Prolimacodes badia","Skiff Moth",Iowa,Linn,2014-07-13,2045-2330,"Hitaga Sand Ridge Prairie Preserve",42.250957,-91.632098,"Jim Durbin",adult,Blacklight/Fluorescent,Photograph,1,74,67,63,3,300,,"partly cloudy",,
193571,,2017-011561,,"Prolimacodes badia","Skiff Moth",Iowa,Linn,2014-07-13,2045-2330,"Hitaga Sand Ridge Prairie Preserve",42.250957,-91.632098,"Jim Durbin",adult,Blacklight/Fluorescent,Photograph,1,74,67,63,3,300,,"partly cloudy",,
193949,,2017-011915,,"Prolimacodes badia","Skiff Moth",Iowa,Linn,2017-07-18,2045-2330,"Wickiup Hill Outdoor Learning Area",42.0876617,-91.767617,"Jim Durbin",adult,Blacklight/Fluorescent,Photograph,1,74,95,72,4,160,30,"partly cloudy","45 % visible",
194170,,2017-012136,,"Prolimacodes badia","Skiff Moth",Iowa,Linn,2017-07-22,2045-2330,"Hitaga Sand Ridge Prairie Preserve",42.250957,-91.632098,"Jim Durbin",adult,Blacklight/Fluorescent,Photograph,1,80,94,78,2,330,29.85,"partly cloudy","10 % visible",
196759,"Paul Martsching Collection",2017-014691,,"Prolimacodes badia","Skiff Moth",Iowa,Story,2017-07-20,,"Ames, Paul",42.02064,-93.623952,"Paul Martsching",adult,"Building Light",Pinned,1,,,,,,,,,
200105,,2017-018036,,"Prolimacodes badia","Skiff Moth",Iowa,Linn,2016-07-09,,"Hitaga Sand Ridge Prairie Preserve",42.250957,-91.632098,"Don F. Becker",adult,,Photograph,1,,,,,,,,,
200117,,2017-018048,,"Prolimacodes badia","Skiff Moth",Iowa,Linn,2016-07-09,,"Hitaga Sand Ridge Prairie Preserve",42.250957,-91.632098,"Don F. Becker",adult,,Photograph,1,,,,,,,,,
212661,,2018-010818,,"Prolimacodes badia","Skiff Moth",Iowa,Linn,2018-06-23,2100-2330,"Hitaga Sand Ridge Prairie Preserve",42.250957,-91.632098,"Jim Durbin",adult,Blacklight/Fluorescent,Photograph,1,68,85,63,5,180,29.81,"partly cloudy","80% visible",
213357,,2018-011513,,"Prolimacodes badia","Skiff Moth",Iowa,Linn,2018-06-27,2100-2330,"Matsell Bridge Natural Area",42.132148,-91.385221,"Jim Durbin",adult,Blacklight/Fluorescent,Photograph,1,80,59,64,0,0,29.77,"partly cloudy",Full,"extremely heavy dew"
217760,,2018-015916,,"Prolimacodes badia","Skiff Moth",Iowa,Winneshiek,2018-07-11,,"100 Acre Wood-x",0,0,"MJ Hatfield",adult,"Blacklight Trap",Photograph,1,,,,,,,,,
232865,,2019-007578,,"Prolimacodes badia","Skiff Moth",Iowa,Linn,2019-06-29,2100-2345,"Wickiup Hill Outdoor Learning Area",42.0876,-91.76787,"Jim Durbin",adult,Blacklight/Fluorescent,Photograph,1,85,69,74,0,180,29.84,Clear,"10% visible",
233004,,2019-007717,,"Prolimacodes badia","Skiff Moth",Iowa,Linn,2019-06-29,2100-2345,"Wickiup Hill Outdoor Learning Area",42.0876,-91.76787,"Jim Durbin",adult,Blacklight/Fluorescent,Photograph,1,85,69,74,0,180,29.84,Clear,"10% visible",
233076,,2019-007869,,"Prolimacodes badia","Skiff Moth",Iowa,Linn,2019-07-04,2100-2315,"Wickiup Hill Outdoor Learning Area",42.086576,-91.766717,"Jim Durbin",adult,Blacklight/Fluorescent,Photograph,1,82,66,69,2,170,29.75,clear,new,
233123,,2019-007916,,"Prolimacodes badia","Skiff Moth",Iowa,Linn,2019-07-04,2100-2315,"Wickiup Hill Outdoor Learning Area",42.086576,-91.766717,"Jim Durbin",adult,Blacklight/Fluorescent,Photograph,1,82,66,69,2,170,29.75,clear,new,
233233,,2019-008026,,"Prolimacodes badia","Skiff Moth",Iowa,Linn,2019-07-04,2100-2315,"Wickiup Hill Outdoor Learning Area",42.086576,-91.766717,"Jim Durbin",adult,Blacklight/Fluorescent,Photograph,1,82,66,69,2,170,29.75,clear,new,
241719,"Frank Olsen Drawer 10",2019-010001,,"Prolimacodes badia","Skiff Moth",Iowa,Allamakee,2004-07-10,,"Yellow River State Forest",43.1676,-91.254,"Frank Olsen",,Blacklight/Fluorescent,Pinned,1,,,,,,,,,"Located at Iowa State"
268207,,,,"Prolimacodes badia","Skiff Moth",Iowa,Linn,2020-06-30,22:40:07,"Hitaga Sand Ridge Prairie Preserve",42.25088735,-91.63212362,"Jim Durbin",adult,Blacklight/Fluorescent,Photograph,1,78,88,74,2,100,29.85,cloudy,"80% visible",
268335,,,,"Prolimacodes badia","Skiff Moth",Iowa,Linn,2020-06-30,21:56:37,"Hitaga Sand Ridge Prairie Preserve",42.25088735,-91.63212362,"Jim Durbin",adult,Blacklight/Fluorescent,Photograph,1,78,88,74,2,100,29.85,cloudy,"80% visible",
268386,,,,"Prolimacodes badia","Skiff Moth",Iowa,Linn,2020-06-30,21:38:18,"Hitaga Sand Ridge Prairie Preserve",42.25088735,-91.63212362,"Jim Durbin",adult,Blacklight/Fluorescent,Photograph,1,78,88,74,2,100,29.85,cloudy,"80% visible",
268387,,,,"Prolimacodes badia","Skiff Moth",Iowa,Linn,2020-06-30,21:38:06,"Hitaga Sand Ridge Prairie Preserve",42.25088735,-91.63212362,"Jim Durbin",adult,Blacklight/Fluorescent,Photograph,1,78,88,74,2,100,29.85,cloudy,"80% visible",
268388,,,,"Prolimacodes badia","Skiff Moth",Iowa,Linn,2020-06-30,21:37:59,"Hitaga Sand Ridge Prairie Preserve",42.25088735,-91.63212362,"Jim Durbin",adult,Blacklight/Fluorescent,Photograph,1,78,88,74,2,100,29.85,cloudy,"80% visible",
268425,,,,"Prolimacodes badia","Skiff Moth",Iowa,Linn,2020-06-30,21:27:15,"Hitaga Sand Ridge Prairie Preserve",42.25088735,-91.63212362,"Jim Durbin",adult,Blacklight/Fluorescent,Photograph,1,78,88,74,2,100,29.85,cloudy,"80% visible",
268431,,,,"Prolimacodes badia","Skiff Moth",Iowa,Linn,2020-06-30,21:26:21,"Hitaga Sand Ridge Prairie Preserve",42.25088735,-91.63212362,"Jim Durbin",adult,Blacklight/Fluorescent,Photograph,1,78,88,74,2,100,29.85,cloudy,"80% visible",
268435,,,,"Prolimacodes badia","Skiff Moth",Iowa,Linn,2020-06-30,21:25:09,"Hitaga Sand Ridge Prairie Preserve",42.25088735,-91.63212362,"Jim Durbin",adult,Blacklight/Fluorescent,Photograph,1,78,88,74,2,100,29.85,cloudy,"80% visible",
290687,,,,"Prolimacodes badia","Skiff Moth",Iowa,Linn,2021-07-15,21:03:00,"Matsell Bridge Natural Area",42.13220412,-91.38527708,"Jim Durbin",adult,Blacklight/Fluorescent,Photograph,1,70,94,68,3,0,29.99,clear,"40% visible",
290842,,,,"Prolimacodes badia","Skiff Moth",Iowa,Linn,2021-07-15,21:26:50,"Matsell Bridge Natural Area",42.13220412,-91.38527708,"Jim Durbin",adult,Blacklight/Fluorescent,Photograph,1,70,94,68,3,0,29.99,clear,"40% visible",
290850,,,,"Prolimacodes badia","Skiff Moth",Iowa,Linn,2021-07-15,21:11:45,"Matsell Bridge Natural Area",42.13220412,-91.38527708,"Jim Durbin",adult,Blacklight/Fluorescent,Photograph,1,70,94,68,3,0,29.99,clear,"40% visible",
315873,,,SPM023691,"Prolimacodes badia","Skiff Moth",Iowa,Winneshiek,2012-06-22,,"100 Acre Wood-x",43.431848,-92.009353,"MJ Hatfield",adult,Blacklight/Fluorescent,Photograph,1,,,,,,,,,
343479,,,,"Prolimacodes badia","Skiff Moth",Iowa,Johnson,2023-07-12,10:30:31,Redacted,Redacted,Redacted,"Mark Brown",adult,Sighting,Photograph,1,,,,,,,,,
345025,,,,"Prolimacodes badia","Skiff Moth",Iowa,Johnson,2023-07-18,,Redacted,Redacted,Redacted,"Mark Brown",adult,Sighting,Photograph,1,,,,,,,,,
