ID,"Collection / Source","Catalog Number","Specify Number",Taxon,"Common Name",State,County,Date,Time,Locale,Latitude,Longitude,Collector,"Life Stage","Collection Method","Preparation Type",Count,Temperature,Humidity,"Dew Point",Wind,"Wind Direction","Barometric Pressure",Sky,"Moon Phase",Notes
17117,"Jim Durbin Drawer 300-06",2014-017416,SPM004358,"Astylopsis arcuata",None,Kentucky,Ohio,2005-06-06,,"Leon's Farm, Ohio County",37.42033,-86.77023,"Jim Durbin",adult,Blacklight/Fluorescent,Pinned,1,,,,,,,,,
17118,,2014-017417,SPM028525,"Astylopsis fascipennis",None,Iowa,Linn,2012-06-15,,"Matsell Bridge Natural Area",42.13131,-91.38886,"Jim Durbin",adult,Blacklight/Fluorescent,Photograph,1,,,,,,,,,
17119,,2014-017418,SPM028540,"Astylopsis fascipennis",None,Iowa,Linn,2012-06-15,,"Matsell Bridge Natural Area",42.13131,-91.38886,"Jim Durbin",adult,Blacklight/Fluorescent,Photograph,1,,,,,,,,,
17120,,2014-017419,SPM028622,"Astylopsis fascipennis",None,Iowa,Linn,2012-06-15,,"Matsell Bridge Natural Area",42.13131,-91.38886,"Jim Durbin",adult,Blacklight/Fluorescent,Photograph,1,,,,,,,,,
17121,,2014-017420,SPM030509,"Astylopsis fascipennis",None,Iowa,Linn,2012-07-16,,"Matsell Bridge Natural Area",42.13131,-91.38886,"Jim Durbin",adult,Blacklight/Fluorescent,Photograph,1,,,,,,,,,
17122,,2014-017421,SPM030528,"Astylopsis fascipennis",None,Iowa,Linn,2012-07-16,,"Matsell Bridge Natural Area",42.13131,-91.38886,"Jim Durbin",adult,Blacklight/Fluorescent,Photograph,1,,,,,,,,,
17125,"Jim Durbin Drawer 300-07",2014-017424,SPM022626,"Astylopsis macula",None,Iowa,Linn,2011-06-30,,"Wanatee County Park",42.0094,-91.56623,"Jim Durbin",adult,Blacklight/Fluorescent,Pinned,1,,,,,,,,,
17126,"Jim Durbin Drawer 300-07",2014-017425,SPM030094,"Astylopsis macula",None,Iowa,Linn,2012-07-12,,"Wanatee County Park",42.0094,-91.56623,"Jim Durbin",adult,Blacklight/Fluorescent,Pinned,1,,,,,,,,,
17127,"Jim Durbin Drawer 300-08",2014-017426,SPM015022,"Astylopsis sexguttata",None,Iowa,Fremont,2009-08-09,,"Waubonsie State Park",40.676,-95.689,"Jim Durbin",adult,Blacklight,Pinned,1,,,,,,,,,
19887,"Jim Durbin Drawer 300-08",2014-020218,SPM006787,"Astylopsis sexguttata",None,Iowa,Linn,2006-07-16,,"Pleasant Creek State Recreation Area, Linn County",42.11952,-91.81215,"Jim Durbin",adult,Blacklight/Fluorescent,Pinned,1,,,,,,,,,
19913,,2014-020244,SPM030853,"Astylopsis sexguttata",None,Iowa,Linn,2012-07-22,,"Wakpicada Natural Area",42.18892,-91.52035,"Jim Durbin",adult,Blacklight/Fluorescent,Photograph,1,,,,,,,,,
19915,,2014-020246,SPM030921,"Astylopsis sexguttata",None,Iowa,Linn,2012-07-22,,"Wakpicada Natural Area",42.18892,-91.52035,"Jim Durbin",adult,Blacklight/Fluorescent,Photograph,1,,,,,,,,,
19947,,2014-020278,SPM036233,"Astylopsis macula",None,Iowa,Linn,2013-08-21,,"Matsell Bridge Natural Area",42.13131,-91.38886,"Jim Durbin",adult,Blacklight/Fluorescent,Photograph,1,,,,,,,,,
19954,,2014-020285,SPM036857,"Astylopsis arcuata",None,Florida,Franklin,2013-10-16,,"St George Island State Park",29.72083,-84.74611,"Jim Durbin",adult,Blacklight/Fluorescent,Photograph,1,,,,,,,,,
214625,,2018-012781,,"Astylopsis macula",None,Iowa,Linn,2018-07-12,2100-2330,"Matsell Bridge Natural Area",42.132148,-91.385221,"Jim Durbin",adult,Blacklight/Fluorescent,Photograph,1,88,56,70,6,90,30.04,clear,"0 visible",
216566,,2018-014722,,"Astylopsis fascipennis",None,Iowa,Winneshiek,2018-06-15,,"100 Acre Wood-x",0,0,"MJ Hatfield",adult,"Blacklight Trap",Photograph,1,,,,,,,,,
247387,,,,"Astylopsis macula",None,Iowa,Linn,2012-06-10,,"Wakpicada Natural Area",42.18892,-91.52035,"Jim Durbin",adult,Blacklight/Fluorescent,Photograph,1,,,,,,,,,
273077,"Paul Martsching Collection",2020-000651,,"Astylopsis sexguttata",None,Iowa,Story,2020-07-18,,"Ames, Paul",42.016779,-93.616948,"Paul Martsching",adult,"Building Light",Pinned,1,,,,,,,,,
295197,"Jim Durbin Drawer 300-08",,,"Astylopsis sexguttata",None,Iowa,Linn,2006-07-09,,Redacted,Redacted,Redacted,"Jim Durbin",adult,Blacklight/Fluorescent,Pinned,1,,,,,,,,,
307350,,,,"Astylopsis macula",None,Iowa,Jefferson,2021-07-22,9:06:58,"Near Fairfield",41.05061219,-92.02396433,"Moni Hayne",adult,Blacklight/Fluorescent,Photograph,1,,,,,,,,,
311576,,,,"Astylopsis macula",None,Iowa,Linn,2022-07-02,20:52:13,"Wanatee County Park",42.01013441,-91.56662262,"Jim Durbin",adult,Blacklight/Fluorescent,Photograph,1,72,61,58,3,190,30.02,clear,"10% moon",
312036,,,,"Astylopsis macula",None,Iowa,Jefferson,2021-07-22,9:06:58,"Near Fairfield",41.05061219,-92.02396433,"Moni Hayne",adult,Blacklight/Fluorescent,Photograph,1,,,,,,,,,
312075,,,,"Astylopsis macula",None,Iowa,Linn,2011-06-30,,"Wanatee County Park",42.0094,-91.56623,"Jim Durbin",adult,Blacklight/Fluorescent,Pinned,1,,,,,,,,,
315046,,,,"Astylopsis collaris",None,Iowa,Johnson,2022-06-16,,"MacBride Nature Recreation Area",41.786882,-91.568447,"Mark Brown",adult,Sighting,Photograph,1,,,,,,,,,
315494,,,,"Astylopsis macula",None,Iowa,Johnson,2022-06-23,,"MacBride Nature Recreation Area",41.786946,-91.568582,"Mark Brown",adult,Sighting,Photograph,1,,,,,,,,,
320599,,,,"Astylopsis macula",None,Iowa,Johnson,2022-07-23,6:06:23,"MacBride Nature Recreation Area",41.786882,-91.568342,"Mark Brown",adult,Sighting,Photograph,1,,,,,,,,,
343277,,,,"Astylopsis sexguttata",None,Iowa,Johnson,2023-06-30,06:14:27,"MacBride Nature Recreation Area",41.786686763333,-91.568532451667,"Mark Brown",adult,Sighting,Photograph,1,,,,,,,,,
