ID,"Collection / Source","Catalog Number","Specify Number",Taxon,"Common Name",State,County,Date,Time,Locale,Latitude,Longitude,Collector,"Life Stage","Collection Method","Preparation Type",Count,Temperature,Humidity,"Dew Point",Wind,"Wind Direction","Barometric Pressure",Sky,"Moon Phase",Notes
864,"Jim Durbin Drawer 037",2014-000864,SPM011210,"Evergestis unimacula","Large-spotted Evergestis Moth",Iowa,Clayton,2008-07-15,,"Bixby State Preserve",42.67502,-91.3988,"Jim Durbin",adult,Blacklight/Fluorescent,Pinned,1,,,,,,,,,
27762,"Frank Olsen Drawer 48",2014-028115,SPM002961,"Evergestis pallidata","Purple-backed Cabbageworm",Iowa,Linn,2004-09-09,,"Wickiup Hill Outdoor Learning Area",42.08398,-91.7651,"Frank Olsen",adult,,Pinned,1,,,,,,,,,"Located at Iowa State"
27763,,2014-028116,SPM019668,"Evergestis pallidata","Purple-backed Cabbageworm",Iowa,Muscatine,2010-05-19,,"Pike Run Wildlife Area",41.49795,-91.20764,"Ryan Rasmussen",adult,,Photograph,1,,,,,,,,,
27764,"Frank Olsen Drawer 48",2014-028117,SPM024864,"Evergestis pallidata","Purple-backed Cabbageworm",Iowa,Jasper,2011-06-01,,"Hartley Heritage Fen",41.7621,-93.347063,"Frank Olsen",adult,,Pinned,1,,,,,,,,,"Located at Iowa State"
27765,,2014-028118,SPM025484,"Evergestis pallidata","Purple-backed Cabbageworm",Iowa,Johnson,2011-06-20,,"Iowa City Site 1",41.62806,-91.51417,"Mark Brown",adult,,Photograph,1,,,,,,,,,
27766,"Jim Durbin Drawer 037",2014-028119,SPM027298,"Evergestis pallidata","Purple-backed Cabbageworm",Iowa,Linn,2012-05-21,,"Matsell Bridge Natural Area",42.13131,-91.38886,"Jim Durbin",adult,Blacklight/Fluorescent,Pinned,1,,,,,,,,,
27767,"Jim Durbin Drawer 037",2014-028120,SPM027299,"Evergestis pallidata","Purple-backed Cabbageworm",Iowa,Linn,2012-05-21,,"Matsell Bridge Natural Area",42.13131,-91.38886,"Jim Durbin",adult,Blacklight/Fluorescent,Pinned,1,,,,,,,,,
27768,,2014-028121,SPM027739,"Evergestis pallidata","Purple-backed Cabbageworm",Iowa,Story,2012-05-28,,"Hickory Grove Park",41.99218,-93.36679,"Jim Durbin",adult,Blacklight/Fluorescent,Photograph,1,,,,,,,,,
27769,"Jim Durbin Drawer 037",2014-028122,SPM028155,"Evergestis pallidata","Purple-backed Cabbageworm",Iowa,Linn,2012-06-10,,"Wakpicada Natural Area",42.18892,-91.52035,"Jim Durbin",adult,Blacklight/Fluorescent,Pinned,1,,,,,,,,,
27771,,2014-028124,SPM029364,"Evergestis pallidata","Purple-backed Cabbageworm",Iowa,Linn,2012-06-22,,"Behren's Pond Woodland State Preserve",42.118214,-91.754324,"Jim Durbin",adult,Blacklight/Fluorescent,Photograph,1,,,,,,,,,
27772,,2014-028125,SPM029739,"Evergestis pallidata","Purple-backed Cabbageworm",Iowa,Jones,2012-07-01,,"Wapsipinicon State Park",42.09038,-91.2861,"Jim Durbin",adult,Blacklight/Fluorescent,Photograph,1,,,,,,,,,
27773,,2014-028126,SPM031533,"Evergestis pallidata","Purple-backed Cabbageworm",Iowa,Kossuth,2012-08-07,,"Ambrose A. Call State Park",43.0517,-94.2498,"Matt Kenne",adult,,Sighting,1,,,,,,,,,
27774,"Frank Olsen Drawer 48",2014-028127,SPM031718,"Evergestis pallidata","Purple-backed Cabbageworm",Iowa,Benton,2012-06-07,,"Minne Estema Park",42.257,-92.0198,"Frank Olsen",adult,,Pinned,1,,,,,,,,,"Located at Iowa State"
27775,,2014-028128,SPM032161,"Evergestis pallidata","Purple-backed Cabbageworm",Iowa,Johnson,2012-07-01,,"Hawkeye Willdlife Management Area",41.77465,-91.71518,"Mark Brown",adult,,Photograph,1,,,,,,,,,
27776,"Frank Olsen Drawer 48",2014-028129,SPM032810,"Evergestis pallidata","Purple-backed Cabbageworm",Iowa,Dubuque,2012-09-12,,"Catfish Creek State Preserve",42.4679,-90.6553,"Frank Olsen",adult,,Pinned,1,,,,,,,,,"Located at Iowa State"
27777,"Frank Olsen Drawer 48",2014-028130,SPM036504,"Evergestis pallidata","Purple-backed Cabbageworm",Iowa,Dubuque,2013-06-19,,"Catfish Creek State Preserve",42.4679,-90.6553,"Frank Olsen",adult,,Pinned,1,,,,,,,,,"Located at Iowa State"
27778,"Frank Olsen Drawer 48",2014-028131,SPM036668,"Evergestis pallidata","Purple-backed Cabbageworm",Iowa,Linn,2013-09-24,,"Wickiup Hill Outdoor Learning Area",42.08398,-91.7651,"Frank Olsen",adult,,Pinned,1,,,,,,,,,"Located at Iowa State"
27779,"Jim Durbin Drawer 037",2014-028132,SPM040433,"Evergestis pallidata","Purple-backed Cabbageworm",Iowa,Linn,2014-06-13,,"Pleasant Creek State Recreation Area, Linn County",42.10948,-91.8249,"Jim Durbin",adult,Blacklight/Fluorescent,Pinned,1,,,,,,,,,
27780,,2014-028133,SPM010859,"Evergestis unimacula","Large-spotted Evergestis Moth",Iowa,Jasper,2004-05-25,,"Neal Smith National Wildlife Refuge",41.57639,-93.265,"Keith Summerville",adult,,Pinned,1,,,,,,,,,
27781,"Jim Durbin Drawer 037",2014-028134,SPM023642,"Evergestis unimacula","Large-spotted Evergestis Moth",Iowa,Winneshiek,2011-08-26,,"100 Acre Wood-x",43.431848,-92.009353,"Jim Durbin",adult,Blacklight/Fluorescent,Pinned,1,,,,,,,,,
27782,"Jim Durbin Drawer 037",2014-028135,SPM028388,"Evergestis unimacula","Large-spotted Evergestis Moth",Iowa,Guthrie,2012-06-08,,"Whiterock Conservancy",41.80725,-94.64085,"Jim Durbin",adult,Blacklight/Fluorescent,Pinned,1,,,,,,,,,
66745,,2014-067350,,"Evergestis unimacula","Large-spotted Evergestis Moth",Iowa,Winneshiek,2011-08-24,,"100 Acre Wood-x",0,0,"MJ Hatfield",adult,,Photograph,1,,,,,,,,,
66776,,2014-067381,,"Evergestis unimacula","Large-spotted Evergestis Moth",Iowa,Winneshiek,2011-08-23,,"100 Acre Wood-x",0,0,"MJ Hatfield",adult,,Photograph,1,,,,,,,,,
66874,,2014-067479,,"Evergestis unimacula","Large-spotted Evergestis Moth",Iowa,Winneshiek,2011-08-14,,"100 Acre Wood-x",0,0,"MJ Hatfield",adult,,Photograph,1,,,,,,,,,
67320,,2014-067925,,"Evergestis unimacula","Large-spotted Evergestis Moth",Iowa,Winneshiek,2012-07-02,,"100 Acre Wood-x",0,0,"MJ Hatfield",adult,,Photograph,1,,,,,,,,,
67426,,2014-068031,,"Evergestis unimacula","Large-spotted Evergestis Moth",Iowa,Winneshiek,2012-06-27,,"100 Acre Wood-x",0,0,"MJ Hatfield",adult,,Photograph,1,,,,,,,,,
110772,,2015-001328,,"Evergestis pallidata","Purple-backed Cabbageworm",Iowa,Polk,2013-06-11,,Redacted,Redacted,Redacted,"Aaron Brees",adult,,Sighting,1,,,,,,,,,
127024,,2015-017586,,"Evergestis pallidata","Purple-backed Cabbageworm",Iowa,Linn,2015-06-16,"2100 to 2300","Wickiup Hill Outdoor Learning Area",42.087567,-91.767578,"Jim Durbin",adult,Blacklight/Fluorescent,Photograph,1,72,65,60,1,90,30.02,clear,"0% visible",
127025,"Jim Durbin Drawer 037",2015-017587,,"Evergestis pallidata","Purple-backed Cabbageworm",Iowa,Linn,2015-06-16,"2100 to 2300","Wickiup Hill Outdoor Learning Area",42.087567,-91.767578,"Jim Durbin",adult,Blacklight/Fluorescent,Pinned,1,72,65,60,1,90,30.02,clear,"0% visible",
127244,,2015-017806,,"Evergestis pallidata","Purple-backed Cabbageworm",Iowa,Linn,2015-06-19,,"Indian Creek Nature Center",41.968932,-91.586884,"Jim Durbin",adult,Blacklight/Fluorescent,Photograph,1,73,65,60,0,0,29.92,clear,"10% visible",
130632,,2015-021222,,"Evergestis pallidata","Purple-backed Cabbageworm",Iowa,Linn,2015-09-15,"1945 - 2200","Indian Creek Nature Center",41.968932,-91.586884,"Jim Durbin",adult,Blacklight/Fluorescent,Photograph,1,76,47,55,7,145,30.01,clear,"5 % visible",
130661,,2015-021251,,"Evergestis pallidata","Purple-backed Cabbageworm",Iowa,Linn,2015-09-15,"1945 - 2200","Indian Creek Nature Center",41.968932,-91.586884,"Jim Durbin",adult,Blacklight/Fluorescent,Photograph,1,76,47,55,7,145,30.01,clear,"5 % visible",
130677,,2015-021267,,"Evergestis pallidata","Purple-backed Cabbageworm",Iowa,Linn,2015-09-15,"1945 - 2200","Indian Creek Nature Center",41.968932,-91.586884,"Jim Durbin",adult,Blacklight/Fluorescent,Photograph,1,76,47,55,7,145,30.01,clear,"5 % visible",
182811,,2017-000772,,"Evergestis pallidata","Purple-backed Cabbageworm",Iowa,Winneshiek,2016-08-24,,"100 Acre Wood-x",0,0,"MJ Hatfield",adult,,Photograph,1,,,,,,,,,
212080,,2018-010237,,"Evergestis pallidata","Purple-backed Cabbageworm",Iowa,Linn,2018-06-11,2100-2300,"Hitaga Sand Ridge Prairie Preserve",42.250957,-91.632098,"Jim Durbin",adult,Blacklight/Fluorescent,Photograph,1,68,84,63,7,90,29.89,cloudy,"10% visible",
212370,,2018-010526,,"Evergestis pallidata","Purple-backed Cabbageworm",Iowa,Linn,2018-06-15,2100-2315,"Wickiup Hill Outdoor Learning Area",42.087352,-91.767107,"Jim Durbin",adult,Blacklight/Florescent,Photograph,1,84,70,73,3,120,29.79,"partly cloudy","0 % visible",
212501,,2018-010657,,"Evergestis pallidata","Purple-backed Cabbageworm",Iowa,Linn,2018-06-15,2100-2315,"Wickiup Hill Outdoor Learning Area",42.087352,-91.767107,"Jim Durbin",adult,Blacklight/Florescent,Photograph,1,84,70,73,3,120,29.79,"partly cloudy","0 % visible",
215530,,2018-013687,,"Evergestis pallidata","Purple-backed Cabbageworm",Iowa,Linn,2018-07-18,2100-2300,"Wickiup Hill Outdoor Learning Area",42.087352,-91.767107,"Jim Durbin",adult,Blacklight/Fluorescent,Photograph,1,75,68,64,4,100,29.98,"partly cloudy","15 % visible",
215598,,2018-013755,,"Evergestis pallidata","Purple-backed Cabbageworm",Iowa,Linn,2018-07-18,2100-2300,"Wickiup Hill Outdoor Learning Area",42.087352,-91.767107,"Jim Durbin",adult,Blacklight/Fluorescent,Photograph,1,75,68,64,4,100,29.98,"partly cloudy","15 % visible",
215862,,2018-014018,,"Evergestis pallidata","Purple-backed Cabbageworm",Iowa,Winneshiek,2018-06-08,,"100 Acre Wood-x",0,0,"MJ Hatfield",adult,"Blacklight Trap",Photograph,1,,,,,,,,,
219531,,2018-017687,,"Evergestis pallidata","Purple-backed Cabbageworm",Iowa,Linn,2018-08-25,2015-2300,"Hitaga Sand Ridge Prairie Preserve",42.250604,-91.629962,"Jim Durbin",adult,Blacklight/Fluorescent,Photograph,1,74,97,73,3,310,29.91,cdlear,"Full Moon",
219573,,2018-017729,,"Evergestis pallidata","Purple-backed Cabbageworm",Iowa,Linn,2018-08-25,2015-2300,"Hitaga Sand Ridge Prairie Preserve",42.250604,-91.629962,"Jim Durbin",adult,Blacklight/Fluorescent,Photograph,1,74,97,73,3,310,29.91,cdlear,"Full Moon",
219625,,2018-017781,,"Evergestis pallidata","Purple-backed Cabbageworm",Iowa,Linn,2018-08-25,2015-2300,"Hitaga Sand Ridge Prairie Preserve",42.250604,-91.629962,"Jim Durbin",adult,Blacklight/Fluorescent,Photograph,1,74,97,73,3,310,29.91,cdlear,"Full Moon",
219724,,2018-018151,,"Evergestis pallidata","Purple-backed Cabbageworm",Iowa,Linn,2018-09-08,1945-2000,"Wickiup Hill Outdoor Learning Area",42.087352,-91.767107,"Jim Durbin",adult,Blacklight/Fluorescent,Photograph,1,65,58,50,2,30,30.05,clear,"10% visible",
239641,"Paul Martsching Collection",2019-009320,,"Evergestis pallidata","Purple-backed Cabbageworm",Iowa,Story,2019-09-01,330,"Ames, Paul",42.02064,-93.623952,"Paul Martsching",adult,"Building Light",Pinned,1,,,,,,,,,
271441,,,,"Evergestis pallidata","Purple-backed Cabbageworm",Iowa,Linn,2020-09-14,20:19:51,"Wickiup Hill Outdoor Learning Area",42.08735192,-91.76707176,"Jim Durbin",adult,Blacklight/Fluorescent,Photograph,1,71,68,60,3,100,29.65,cloudy,"10% visible",
307175,,,,"Evergestis pallidata","Purple-backed Cabbageworm",Iowa,Jefferson,2021-07-21,21:51:45,"Near Fairfield",41.05061219,-92.02396433,"Moni Hayne",adult,Blacklight/Fluorescent,Photograph,1,,,,,,,,,
310388,,,,"Evergestis pallidata","Purple-backed Cabbageworm",Iowa,Linn,2022-06-16,22:39:56,"Wanatee County Park",42.01007932,-91.56651807,"Jim Durbin",adult,Blacklight/Fluorescent,Photograph,1,77,50,57,8,270,29.96,clear,full,
343420,,,,"Evergestis pallidata","Purple-backed Cabbageworm",Iowa,Webster,2023-07-01,09:43:50,"Brushy Creek State Recreation Area",42.38334197,-93.971104778333,"Mark Brown",adult,Sighting,Photograph,1,,,,,,,,,
355988,,,,"Evergestis unimacula","Large-spotted Evergestis Moth",Iowa,Winneshiek,2018-08-07,,"Hickory Ridge Woods",43.3178,-91.7959,"Lena Schmitt",adult,,,1,,,,,,,,,"Data from Kirk Larsen, Luther College"
355989,,,,"Evergestis unimacula","Large-spotted Evergestis Moth",Iowa,Winneshiek,2018-06-24,,"Hickory Ridge Woods",43.3178,-91.7959,"Lena Schmitt",adult,,,1,,,,,,,,,"Data from Kirk Larsen, Luther College"
356485,,,,"Evergestis pallidata","Purple-backed Cabbageworm",Iowa,Winneshiek,2018-06-06,,"Jewell Prairie",43.320278,-91.826944,"Lena Schmitt",adult,,,1,,,,,,,,,"Data from Kirk Larsen, Luther College"
356486,,,,"Evergestis pallidata","Purple-backed Cabbageworm",Iowa,Winneshiek,2018-06-24,,"Jewell Prairie",43.320278,-91.826944,"Lena Schmitt",adult,,,1,,,,,,,,,"Data from Kirk Larsen, Luther College"
356925,,,,"Evergestis pallidata","Purple-backed Cabbageworm",Iowa,Winneshiek,2018-06-06,,"Lionberger Environmental Preserve",43.334148,-91.871215,"Lena Schmitt",adult,,,1,,,,,,,,,"Data from Kirk Larsen, Luther College"
358675,,,,"Evergestis pallidata","Purple-backed Cabbageworm",Iowa,Winneshiek,2018-09-13,,"Roslien Woods",43.3244,-91.8216,"Lena Schmitt",adult,,,1,,,,,,,,,"Data from Kirk Larsen, Luther College"
358676,,,,"Evergestis unimacula","Large-spotted Evergestis Moth",Iowa,Winneshiek,2018-06-24,,"Roslien Woods",43.3244,-91.8216,"Lena Schmitt",adult,,,1,,,,,,,,,"Data from Kirk Larsen, Luther College"
