ID,"Collection / Source","Catalog Number","Specify Number",Taxon,"Common Name",State,County,Date,Time,Locale,Latitude,Longitude,Collector,"Life Stage","Collection Method","Preparation Type",Count,Temperature,Humidity,"Dew Point",Wind,"Wind Direction","Barometric Pressure",Sky,"Moon Phase",Notes
41518,,2014-041895,SPM010842,"Eucosma tomonana","Aster-head Phaneta Moth",Iowa,Jasper,2004-05-25,,"Neal Smith National Wildlife Refuge",41.57639,-93.265,"Keith Summerville",adult,,Pinned,1,,,,,,,,,
41522,,2014-041899,SPM024976,"Eucosma tomonana","Aster-head Phaneta Moth",Iowa,Johnson,2011-09-20,,"Iowa City",41.667,-91.545,"Mark Brown",adult,,Photograph,1,,,,,,,,,
41523,,2014-041900,SPM025466,"Eucosma tomonana","Aster-head Phaneta Moth",Iowa,Johnson,2011-10-20,,"Iowa City Site 1",41.62806,-91.51417,"Mark Brown",adult,,Photograph,1,,,,,,,,,
41524,,2014-041901,,"Eucosma tomonana","Aster-head Phaneta Moth",Iowa,Johnson,2011-09-20,,"Iowa City",41.667,-91.545,"Mark Brown",,,Photograph,1,,,,,,,,,
41525,"Jim Durbin Drawer 014",2014-041902,SPM028382,"Eucosma tomonana","Aster-head Phaneta Moth",Iowa,Guthrie,2012-06-08,,"Whiterock Conservancy",41.80725,-94.64085,"Jim Durbin",adult,Blacklight/Fluorescent,Pinned,1,,,,,,,,,
110611,,2015-001167,,"Eucosma tomonana","Aster-head Phaneta Moth",Iowa,Polk,2013-08-23,,Redacted,Redacted,Redacted,"Aaron Brees",adult,,Sighting,1,,,,,,,,,
143556,,2016-008285,,"Eucosma tomonana","Aster-head Phaneta Moth",Iowa,Johnson,2015-09-02,,Redacted,Redacted,Redacted,"Mark Brown",adult,,Photograph,1,,,,,,,,,
146134,,2016-010761,,"Eucosma tomonana","Aster-head Phaneta Moth",Iowa,Winneshiek,2012-08-23,,"Plymouth Rock-x",0,0,"MJ Hatfield",adult,,Photograph,1,,,,,,,,,
146141,,2016-010768,,"Eucosma tomonana","Aster-head Phaneta Moth",Iowa,Winneshiek,2012-08-23,,"Plymouth Rock-x",0,0,"MJ Hatfield",adult,,Photograph,1,,,,,,,,,
146163,,2016-010790,,"Eucosma tomonana","Aster-head Phaneta Moth",Iowa,Winneshiek,2012-08-29,,"Plymouth Rock-x",0,0,"MJ Hatfield",adult,,Photograph,1,,,,,,,,,
146165,,2016-010792,,"Eucosma tomonana","Aster-head Phaneta Moth",Iowa,Winneshiek,2012-08-29,,"Plymouth Rock-x",0,0,"MJ Hatfield",adult,,Photograph,1,,,,,,,,,
195966,,2017-013930,,"Eucosma tomonana","Aster-head Phaneta Moth",Iowa,Linn,2017-08-23,2000-2300,"Hitaga Sand Ridge Prairie Preserve",42.250957,-91.632098,"Jim Durbin",adult,Blacklight/Fluorescent,Photograph,1,66,84,61,,,30.03,clear,"0 visible",
195967,,2017-013931,,"Eucosma tomonana","Aster-head Phaneta Moth",Iowa,Linn,2017-08-23,2000-2300,"Hitaga Sand Ridge Prairie Preserve",42.250957,-91.632098,"Jim Durbin",adult,Blacklight/Fluorescent,Photograph,1,66,84,61,,,30.03,clear,"0 visible",
195990,,2017-013954,,"Eucosma tomonana","Aster-head Phaneta Moth",Iowa,Linn,2017-08-30,2000-2300,"Hitaga Sand Ridge Prairie Preserve",42.250957,-91.632098,"Jim Durbin",adult,Blacklight/Fluorescent,Photograph,1,70,90,68,0,0,30.07,clear,"50% visible",
196095,,2017-014059,,"Eucosma tomonana","Aster-head Phaneta Moth",Iowa,Linn,2017-08-30,2000-2300,"Hitaga Sand Ridge Prairie Preserve",42.250957,-91.632098,"Jim Durbin",adult,Blacklight/Fluorescent,Photograph,1,70,90,68,0,0,30.07,clear,"50% visible",
196182,"Jim Durbin Drawer 014",2017-014146,,"Eucosma tomonana","Aster-head Phaneta Moth",Iowa,Linn,2017-08-30,2000-2300,"Hitaga Sand Ridge Prairie Preserve",42.250957,-91.632098,"Jim Durbin",adult,Blacklight/Fluorescent,Pinned,1,70,90,68,0,0,30.07,clear,"50% visible",
196193,"Jim Durbin Drawer 014",2017-014157,,"Eucosma tomonana","Aster-head Phaneta Moth",Iowa,Linn,2017-08-30,2000-2300,"Hitaga Sand Ridge Prairie Preserve",42.250957,-91.632098,"Jim Durbin",adult,Blacklight/Fluorescent,Pinned,1,70,90,68,0,0,30.07,clear,"50% visible",
209635,,2018-007792,,"Eucosma tomonana","Aster-head Phaneta Moth",Iowa,Jefferson,2016-06-16,,"Near Fairfield",41.0503,-92.024,"Moni Hayne",adult,Blacklight/Fluorescent,Photograph,1,,,,,,,,,
217190,,2018-015346,,"Eucosma tomonana","Aster-head Phaneta Moth",Iowa,Winneshiek,2018-06-28,,"100 Acre Wood-x",0,0,"MJ Hatfield",adult,"Blacklight Trap",Photograph,1,,,,,,,,,
217996,,2018-016152,,"Eucosma tomonana","Aster-head Phaneta Moth",Iowa,Linn,2018-08-08,2045-2315,"Hitaga Sand Ridge Prairie Preserve",42.250957,-91.632098,"Jim Durbin",adult,Blacklight/Fluorescent,Photograph,1,73,83,68,6,210,29.93,clear,"10 % visible",
218044,,2018-016200,,"Eucosma tomonana","Aster-head Phaneta Moth",Iowa,Linn,2018-08-08,2045-2315,"Hitaga Sand Ridge Prairie Preserve",42.250957,-91.632098,"Jim Durbin",adult,Blacklight/Fluorescent,Photograph,1,73,83,68,6,210,29.93,clear,"10 % visible",
218234,,2018-016390,,"Eucosma tomonana","Aster-head Phaneta Moth",Iowa,Linn,2018-08-08,2045-2315,"Hitaga Sand Ridge Prairie Preserve",42.250957,-91.632098,"Jim Durbin",adult,Blacklight/Fluorescent,Photograph,1,73,83,68,6,210,29.93,clear,"10 % visible",
218281,,2018-016437,,"Eucosma tomonana","Aster-head Phaneta Moth",Iowa,Linn,2018-08-08,2045-2315,"Hitaga Sand Ridge Prairie Preserve",42.250957,-91.632098,"Jim Durbin",adult,Blacklight/Fluorescent,Photograph,1,73,83,68,6,210,29.93,clear,"10 % visible",
218489,,2018-016645,,"Eucosma tomonana","Aster-head Phaneta Moth",Iowa,Linn,2018-08-11,2030-2300,"Hitaga Sand Ridge Prairie Preserve",42.250604,-91.629962,"Jim Durbin",adult,Blacklight/Fluorescent,Photograph,1,74,81,68,5,45,30.06,clear,dark,
218648,,2018-016804,,"Eucosma tomonana","Aster-head Phaneta Moth",Iowa,Linn,2018-08-11,2030-2300,"Hitaga Sand Ridge Prairie Preserve",42.250604,-91.629962,"Jim Durbin",adult,Blacklight/Fluorescent,Photograph,1,74.0,81.0,68.0,5.0,45,30.06,clear,dark,
219355,,2018-017511,,"Eucosma tomonana","Aster-head Phaneta Moth",Iowa,Linn,2018-08-25,2015-2300,"Hitaga Sand Ridge Prairie Preserve",42.250604,-91.629962,"Jim Durbin",adult,Blacklight/Fluorescent,Photograph,1,74,97,73,3,310,29.91,cdlear,"Full Moon",
219417,,2018-017573,,"Eucosma tomonana","Aster-head Phaneta Moth",Iowa,Linn,2018-08-25,2015-2300,"Hitaga Sand Ridge Prairie Preserve",42.250604,-91.629962,"Jim Durbin",adult,Blacklight/Fluorescent,Photograph,1,74,97,73,3,310,29.91,cdlear,"Full Moon",
219457,,2018-017613,,"Eucosma tomonana","Aster-head Phaneta Moth",Iowa,Linn,2018-08-25,2015-2300,"Hitaga Sand Ridge Prairie Preserve",42.250604,-91.629962,"Jim Durbin",adult,Blacklight/Fluorescent,Photograph,1,74,97,73,3,310,29.91,cdlear,"Full Moon",
219491,,2018-017647,,"Eucosma tomonana","Aster-head Phaneta Moth",Iowa,Linn,2018-08-25,2015-2300,"Hitaga Sand Ridge Prairie Preserve",42.250604,-91.629962,"Jim Durbin",adult,Blacklight/Fluorescent,Photograph,1,74,97,73,3,310,29.91,cdlear,"Full Moon",
221147,,2018-019301,,"Eucosma tomonana","Aster-head Phaneta Moth",Iowa,Winneshiek,2018-08-20,,"100 Acre Wood-x",0,0,"MJ Hatfield",adult,"Blacklight Trap",Photograph,1,,,,,,,,,
221185,,2018-019339,,"Eucosma tomonana","Aster-head Phaneta Moth",Iowa,Winneshiek,2018-08-20,,"100 Acre Wood-x",0,0,"MJ Hatfield",adult,"Blacklight Trap",Photograph,1,,,,,,,,,
222188,,2018-020342,,"Eucosma tomonana","Aster-head Phaneta Moth",Iowa,Winneshiek,2018-07-01,,"100 Acre Wood-x",0,0,"MJ Hatfield",adult,"Blacklight Trap",Photograph,1,,,,,,,,,
224400,"Jim Durbin Drawer 014",2018-022763,,"Eucosma tomonana","Aster-head Phaneta Moth",Iowa,Winneshiek,2018-08-20,,"100 Acre Wood-x",0,0,"MJ Hatfield",adult,"Blacklight Trap",Pinned,1,,,,,,,,,
224434,"Jim Durbin Drawer 014",2018-022569,,"Eucosma tomonana","Aster-head Phaneta Moth",Iowa,Linn,2018-08-25,,"Hitaga Sand Ridge Prairie Preserve",42.250957,-91.632098,"Jim Durbin",adult,Blacklight/Fluorescent,Pinned,1,,,,,,,,,
224435,"Jim Durbin Drawer 014",2018-022570,,"Eucosma tomonana","Aster-head Phaneta Moth",Iowa,Linn,2018-08-25,,"Hitaga Sand Ridge Prairie Preserve",42.250957,-91.632098,"Jim Durbin",adult,Blacklight/Fluorescent,Pinned,1,,,,,,,,,
224436,"Jim Durbin Drawer 014",2018-022571,,"Eucosma tomonana","Aster-head Phaneta Moth",Iowa,Linn,2018-08-25,,"Hitaga Sand Ridge Prairie Preserve",42.250957,-91.632098,"Jim Durbin",adult,Blacklight/Fluorescent,Pinned,1,,,,,,,,,
224443,"Jim Durbin Drawer 014",2018-022578,,"Eucosma tomonana","Aster-head Phaneta Moth",Iowa,Linn,2018-08-25,,"Hitaga Sand Ridge Prairie Preserve",42.250957,-91.632098,"Jim Durbin",adult,Blacklight/Fluorescent,Pinned,1,,,,,,,,,
224444,"Jim Durbin Drawer 014",2018-022579,,"Eucosma tomonana","Aster-head Phaneta Moth",Iowa,Linn,2018-08-25,,"Hitaga Sand Ridge Prairie Preserve",42.250957,-91.632098,"Jim Durbin",adult,Blacklight/Fluorescent,Pinned,1,,,,,,,,,
236145,,,,"Eucosma tomonana","Aster-head Phaneta Moth",Iowa,Linn,2019-08-14,2030-2300,"Hitaga Sand Ridge Prairie Preserve",42.250886,-91.632106,"Jim Durbin",adult,Sighting,Photograph,1,68,89,65,2,260,29.91,"partly cloidy",full,
236873,,,,"Eucosma tomonana","Aster-head Phaneta Moth",Iowa,Linn,2019-08-24,2030-2300,"Hitaga Sand Ridge Prairie Preserve",42.250957,-91.632098,"Jim Durbin",adult,Blacklight/Fluorescent,Photograph,1,65,71,56,2,90,30.01,"partly cloudy","50% visible",
237704,,,,"Eucosma tomonana","Aster-head Phaneta Moth",Iowa,Linn,2019-08-24,2030-2300,"Hitaga Sand Ridge Prairie Preserve",42.250957,-91.632098,"Jim Durbin",adult,Blacklight/Fluorescent,Photograph,1,65,71,56,2,90,30.01,"partly cloudy","50% visible",
238233,,,,"Eucosma tomonana","Aster-head Phaneta Moth",Iowa,Johnson,2019-09-03,,Redacted,Redacted,Redacted,"Mark Brown",adult,"Building Light",Photograph,1,,,,,,,,,
238757,,,,"Eucosma tomonana","Aster-head Phaneta Moth",Iowa,Linn,2019-08-14,2030-2300,"Hitaga Sand Ridge Prairie Preserve",42.250886,-91.632106,"Jim Durbin",adult,Sighting,Photograph,1,68,89,65,2,260,29.91,"partly cloidy",full,
246480,,,,"Eucosma tomonana","Aster-head Phaneta Moth",Iowa,Kossuth,2019-08-08,,Algona,43.06998,-94.23295,"Matt Kenne",adult,Blacklight/Fluorescent,Photograph,1,,,,,,,,,
246486,,,,"Eucosma tomonana","Aster-head Phaneta Moth",Iowa,Kossuth,2019-09-01,,"Union Slough National Wildlife Refuge",43.23852,-94.15303,"Matt Kenne",adult,Blacklight/Fluorescent,Photograph,1,,,,,,,,,
266720,,,,"Eucosma tomonana","Aster-head Phaneta Moth",Iowa,Linn,2020-06-12,22:27:44,"Hitaga Sand Ridge Prairie Preserve",42.2508675,-91.63209427,"Jim Durbin",adult,Blacklight/Fluorescent,Photograph,1,76,48,55,0,0,30.17,"partly cloudy","80% visible",
269721,,,,"Eucosma tomonana","Aster-head Phaneta Moth",Iowa,Linn,2020-08-08,22:46:22,"Hitaga Sand Ridge Prairie Preserve",42.25088607,-91.63213435,"Jim Durbin",adult,Blacklight/Fluorescent,Photograph,1,78,81,71,7,180,30.02,clear,"80% visible",
269773,,,,"Eucosma tomonana","Aster-head Phaneta Moth",Iowa,Linn,2020-08-08,22:34:33,"Hitaga Sand Ridge Prairie Preserve",42.25088607,-91.63213435,"Jim Durbin",adult,Blacklight/Fluorescent,Photograph,1,78,81,71,7,180,30.02,clear,"80% visible",
270004,,,,"Eucosma tomonana","Aster-head Phaneta Moth",Iowa,Linn,2020-08-08,21:04:39,"Hitaga Sand Ridge Prairie Preserve",42.25088607,-91.63213435,"Jim Durbin",adult,Blacklight/Fluorescent,Photograph,1,78,81,71,7,180,30.02,clear,"80% visible",
270814,,,,"Eucosma tomonana","Aster-head Phaneta Moth",Iowa,Linn,2020-08-29,21:41:43,"Hitaga Sand Ridge Prairie Preserve",42.25085584,-91.63207192,"Jim Durbin",adult,Blacklight/Fluorescent,Photograph,1,64,64,52,5,350,29.91,clear,"90% visible",
270923,,,,"Eucosma tomonana","Aster-head Phaneta Moth",Iowa,Linn,2020-08-29,20:45:58,"Hitaga Sand Ridge Prairie Preserve",42.25085584,-91.63207192,"Jim Durbin",adult,Blacklight/Fluorescent,Photograph,1,64,64,52,5,350,29.91,clear,"90% visible",
270958,,,,"Eucosma tomonana","Aster-head Phaneta Moth",Iowa,Linn,2020-08-29,20:25:50,"Hitaga Sand Ridge Prairie Preserve",42.25085584,-91.63207192,"Jim Durbin",adult,Blacklight/Fluorescent,Photograph,1,64,64,52,5,350,29.91,clear,"90% visible",
270966,,,,"Eucosma tomonana","Aster-head Phaneta Moth",Iowa,Linn,2020-08-29,20:23:50,"Hitaga Sand Ridge Prairie Preserve",42.25085584,-91.63207192,"Jim Durbin",adult,Blacklight/Fluorescent,Photograph,1,64,64,52,5,350,29.91,clear,"90% visible",
271002,,,,"Eucosma tomonana","Aster-head Phaneta Moth",Iowa,Linn,2020-09-02,21:35:15,"Matsell Bridge Natural Area",42.13215415,-91.38528784,"Jim Durbin",adult,Blacklight/Fluorescent,Photograph,1,75,43,48,0,0,29.31,cxlear,"full moon",
271016,,,,"Eucosma tomonana","Aster-head Phaneta Moth",Iowa,Linn,2020-09-02,21:24:08,"Matsell Bridge Natural Area",42.13215415,-91.38528784,"Jim Durbin",adult,Blacklight/Fluorescent,Photograph,1,75,43,48,0,0,29.31,cxlear,"full moon",
271023,,,,"Eucosma tomonana","Aster-head Phaneta Moth",Iowa,Linn,2020-09-02,21:22:00,"Matsell Bridge Natural Area",42.13215415,-91.38528784,"Jim Durbin",adult,Blacklight/Fluorescent,Photograph,1,75,43,48,0,0,29.31,cxlear,"full moon",
271269,,,,"Eucosma tomonana","Aster-head Phaneta Moth",Iowa,Story,2020-09-05,20:55:20,"Hertz Family Woods and Nature Preserve",41.98899391,-93.44316226,"Jim Durbin",adult,Blacklight/Fluorescent,Photograph,1,,,,,,,,,
298955,,,,"Eucosma tomonana","Aster-head Phaneta Moth",Iowa,Johnson,2021-09-01,,Redacted,Redacted,Redacted,"Mark Brown",adult,"Building Light",Photograph,1,,,,,,,,,
313780,,,,"Eucosma tomonana","Aster-head Phaneta Moth",Iowa,Linn,2022-08-25,21:55:12,"Hitaga Sand Ridge Prairie Preserve",42.25103416,-91.63218888,"Jim Durbin",adult,Blacklight/Fluorescent,Photograph,1,73,90,70,2,350,30.03,clear,"10% visible",
313797,,,,"Eucosma tomonana","Aster-head Phaneta Moth",Iowa,Linn,2022-08-25,21:49:20,"Hitaga Sand Ridge Prairie Preserve",42.25103416,-91.63218888,"Jim Durbin",adult,Blacklight/Fluorescent,Photograph,1,73,90,70,2,350,30.03,clear,"10% visible",
313890,,,,"Eucosma tomonana","Aster-head Phaneta Moth",Iowa,Linn,2022-08-25,21:12:33,"Hitaga Sand Ridge Prairie Preserve",42.25103416,-91.63218888,"Jim Durbin",adult,Blacklight/Fluorescent,Photograph,1,73,90,70,2,350,30.03,clear,"10% visible",
313936,,,,"Eucosma tomonana","Aster-head Phaneta Moth",Iowa,Linn,2022-08-25,20:50:44,"Hitaga Sand Ridge Prairie Preserve",42.25103416,-91.63218888,"Jim Durbin",adult,Blacklight/Fluorescent,Photograph,1,73,90,70,2,350,30.03,clear,"10% visible",
314053,,,,"Eucosma tomonana","Aster-head Phaneta Moth",Iowa,Johnson,2022-08-30,22:49:43,"F. W. Kent Park",41.73491755,-91.72195511,"Jim Durbin",adult,Blacklight/Fluorescent,Photograph,1,69,72,60,0,0,30.04,clear,"10% visible",
314121,,,,"Eucosma tomonana","Aster-head Phaneta Moth",Iowa,Johnson,2022-08-30,22:18:58,"F. W. Kent Park",41.73491755,-91.72195511,"Jim Durbin",adult,Blacklight/Fluorescent,Photograph,1,69,72,60,0,0,30.04,clear,"10% visible",
314176,,,,"Eucosma tomonana","Aster-head Phaneta Moth",Iowa,Johnson,2022-08-30,21:58:09,"F. W. Kent Park",41.73491755,-91.72195511,"Jim Durbin",adult,Blacklight/Fluorescent,Photograph,1,69,72,60,0,0,30.04,clear,"10% visible",
331976,,,,"Eucosma tomonana","Aster-head Phaneta Moth",Iowa,Johnson,2022-08-29,,Redacted,Redacted,Redacted,"Mark Brown",adult,Sighting,Photograph,1,,,,,,,,,
340855,,,,"Eucosma tomonana","Aster-head Phaneta Moth",Iowa,Linn,2023-08-25,21:12:26,"Hitaga Sand Ridge Prairie Preserve",42.25093191,-91.63218534,"Jim Durbin",adult,Blacklight/Fluorescent,Photograph,1,81,72,71,5,345,29.93,clear,"60% visible",
340864,,,,"Eucosma tomonana","Aster-head Phaneta Moth",Iowa,Linn,2023-08-25,21:15:36,"Hitaga Sand Ridge Prairie Preserve",42.25093191,-91.63218534,"Jim Durbin",adult,Blacklight/Fluorescent,Photograph,1,81,72,71,5,345,29.93,clear,"60% visible",
340922,,,,"Eucosma tomonana","Aster-head Phaneta Moth",Iowa,Linn,2023-08-25,21:38:18,"Hitaga Sand Ridge Prairie Preserve",42.25093191,-91.63218534,"Jim Durbin",adult,Blacklight/Fluorescent,Photograph,1,81,72,71,5,345,29.93,clear,"60% visible",
340944,,,,"Eucosma tomonana","Aster-head Phaneta Moth",Iowa,Linn,2023-08-25,21:43:03,"Hitaga Sand Ridge Prairie Preserve",42.25093191,-91.63218534,"Jim Durbin",adult,Blacklight/Fluorescent,Photograph,1,81,72,71,5,345,29.93,clear,"60% visible",
341153,,,,"Eucosma tomonana","Aster-head Phaneta Moth",Iowa,Linn,2023-08-31,21:45:12,"Palisades Kepler State Park",41.90835858,-91.50240348,"Jim Durbin",adult,Blacklight/Fluorescent,Photograph,1,65,54,48,8,100,30.06,clear,full,
341209,,,,"Eucosma tomonana","Aster-head Phaneta Moth",Iowa,Muscatine,2023-09-12,19:55:02,"Big Sand Mound Prairie Preserve, Muscatine County",41.34023049,-91.08094105,"Jim Durbin",adult,Blacklight/Fluorescent,Photograph,1,,,,,,,,,
341267,,,,"Eucosma tomonana","Aster-head Phaneta Moth",Iowa,Muscatine,2023-09-12,21:20:37,"Big Sand Mound Prairie Preserve, Muscatine County",41.34023049,-91.08094105,"Jim Durbin",adult,Blacklight/Fluorescent,Photograph,1,,,,,,,,,
341271,,,,"Eucosma tomonana","Aster-head Phaneta Moth",Iowa,Muscatine,2023-09-12,21:21:54,"Big Sand Mound Prairie Preserve, Muscatine County",41.34023049,-91.08094105,"Jim Durbin",adult,Blacklight/Fluorescent,Photograph,1,,,,,,,,,
348207,,,,"Eucosma tomonana","Aster-head Phaneta Moth",Iowa,Johnson,2023-08-28,22:53:21,Redacted,Redacted,Redacted,"Mark Brown",adult,Sighting,Photograph,1,,,,,,,,,
