ID,"Collection / Source","Catalog Number","Specify Number",Taxon,"Common Name",State,County,Date,Time,Locale,Latitude,Longitude,Collector,"Life Stage","Collection Method","Preparation Type",Count,Temperature,Humidity,"Dew Point",Wind,"Wind Direction","Barometric Pressure",Sky,"Moon Phase",Notes
30608,"Jim Durbin Drawer 314-09",2014-030976,SPM001323,"Hydrophilus triangularis","Giant Water Scavenger Beetle",Iowa,"Van Buren",2004-04-16,,"Shimek State Forest, Farmington Unit",40.6659,-91.73637,"Jim Durbin",adult,Blacklight,Pinned,1,,,,,,,,,
30609,"Jim Durbin Drawer 314-19",2014-030977,SPM001324,"Hydrophilus ovatus",None,Iowa,"Van Buren",2004-04-16,,"Shimek State Forest, Farmington Unit",40.6659,-91.73637,"Jim Durbin",adult,Blacklight,Pinned,1,,,,,,,,,
30610,"Jim Durbin Drawer 314-09",2014-030978,SPM001325,"Hydrophilus triangularis","Giant Water Scavenger Beetle",Iowa,"Van Buren",2004-04-16,,"Shimek State Forest, Farmington Unit",40.6659,-91.73637,"Jim Durbin",adult,Blacklight,Pinned,1,,,,,,,,,
30611,"Jim Durbin Drawer 314-19",2014-030979,SPM001326,"Hydrophilus ovatus",None,Iowa,"Van Buren",2004-04-16,,"Shimek State Forest, Farmington Unit",40.6659,-91.73637,"Jim Durbin",adult,Blacklight,Pinned,1,,,,,,,,,
30612,"Jim Durbin Drawer 314-19",2014-030980,SPM004057,"Hydrophilus ovatus",None,Iowa,"Van Buren",2005-05-11,,"Shimek State Forest, Farmington Unit",40.6659,-91.73637,"Jim Durbin",adult,Blacklight/Fluorescent,Pinned,1,,,,,,,,,
30613,"Jim Durbin Drawer 314-09",2014-030981,SPM007296,"Hydrophilus triangularis","Giant Water Scavenger Beetle",Iowa,Linn,2005-09-04,,"Matsell Bridge Natural Area",42.13131,-91.38886,"Jim Durbin",adult,Blacklight/Fluorescent,Pinned,1,,,,,,,,,
30614,,2014-030982,SPM019644,"Hydrophilus triangularis","Giant Water Scavenger Beetle",Kentucky,Ohio,2010-05-01,,Redacted,Redacted,Redacted,"Jourdan Yeckering",adult,,Pinned,1,,,,,,,,,
129055,,2015-019645,,"Hydrophilus ovatus",None,Iowa,Scott,2015-07-18,,Walcott,41.59151,-90.781632,"Moni Hayne",adult,,Photograph,1,,,,,,,,,
137715,,2016-002259,,"Hydrophilus triangularis","Giant Water Scavenger Beetle",Iowa,Johnson,2013-04-30,,"University Heights",41.655,-91.55667,"Mark Brown",adult,,Photograph,1,,,,,,,,,
145661,,2016-010282,,"Hydrophilus triangularis","Giant Water Scavenger Beetle",Iowa,Allamakee,2015-05-06,,Redacted,Redacted,Redacted,"Kyle E. Johnson",adult,,,1,69,,,,,," mostly cloudy/light wind, showers prior",,
167094,,2016-031839,,"Hydrophilus ovatus",None,Iowa,Linn,2016-05-23,2030-2300,"Matsell Bridge Natural Area",42.131126,-91.388999,"Jim Durbin",adult,Blacklight/Fluorescent,Photograph,1,74,42,50,7,130,29.82,clear,Full,
167113,,2016-031858,,"Hydrophilus ovatus",None,Iowa,Linn,2016-05-23,2030-2300,"Matsell Bridge Natural Area",42.131126,-91.388999,"Jim Durbin",adult,Blacklight/Fluorescent,Photograph,1,74,42,50,7,130,29.82,clear,Full,
167899,,2016-032644,,"Hydrophilus ovatus",None,Iowa,Linn,2016-05-29,2030-2300,"Vecny Woods",41.956725,-91.600854,"Jim Durbin",adult,Blacklight/Fluorescent,Photograph,1,76,54,58,0,180,29.94,"partly cloudy","80% visible","Very damp with short shower."
200723,"Paul Martsching Collection",2017-018655,,"Hydrophilus ovatus",None,Iowa,Story,1997-07-25,,"Ames, Paul",42.02064,-93.623952,"Paul Martsching",adult,,Pinned,1,,,,,,,,,
200724,"Paul Martsching Collection",2017-018656,,"Hydrophilus ovatus",None,Iowa,Story,1998-07-16,,"Ames, Paul",42.02064,-93.623952,"Paul Martsching",adult,,Pinned,1,,,,,,,,,
266652,,,,"Hydrophilus ovatus",None,Iowa,Lee,2020-06-05,21:10:42,"Heron Bend Conservation Area",40.570351,-91.42323,"Angella Moorehouse",adult,Blacklight/Fluorescent,Photograph,1,,,,,,,clear,"near full","night lighting at Heron Bend Conservation area with staff from Lee County Conservation Board"
273071,"Paul Martsching Collection",2020-000645,,"Hydrophilus triangularis","Giant Water Scavenger Beetle",Iowa,Story,2020-09-25,,"Ames, Paul",42.016779,-93.616948,"Paul Martsching",adult,"Building Light",Pinned,1,,,,,,,,,
314685,,,,"Hydrophilus triangularis","Giant Water Scavenger Beetle",Iowa,"Buena Vista",2022-09-19,13:44:37,"Linn Grove",42.89,-95.24,"Bethany Peat",,,Photograph,1,,,,,,,,,"Not obvious from photo but back legs look serrated. Found in library patron's raspberries in Linn Grove."
335395,,,,"Hydrophilus ovatus",None,Iowa,Muscatine,2023-06-21,21:21:43,"Big Sand Mound Prairie Preserve, Muscatine County",41.342624268333,-91.086409253333,"Jim Durbin",adult,Blacklight/Fluorescent,Photograph,1,80,56,63,0,90,30.01,clear,"10% visible",
336073,,,,"Hydrophilus ovatus",None,Iowa,Linn,2023-06-29,21:28:24,"Indian Creek Nature Center",41.96608977,-91.58982624,"Jim Durbin",adult,Blacklight/Fluorescent,Photograph,1,76,92,74,0,330,29.88,hazy,"50% visible",
349473,,,,"Hydrophilus triangularis","Giant Water Scavenger Beetle",Iowa,Story,2023-05-27,,Ames,42.012953,-93.60424,"Alexandr Slutskyi",adult,Sighting,Photograph,1,,,,,,,,,
366366,,,,"Hydrophilus triangularis","Giant Water Scavenger Beetle",Iowa,Louisa,2024-05-21,10:54:16,"Big Sand Mound Prairie Preserve, Louisa County",41.33244282,-91.08067326,"Don F. Becker",adult,Sighting,Photograph,1,,,,,,,,,"bigger than I am used to seeing"
