ID,"Collection / Source","Catalog Number","Specify Number",Taxon,"Common Name",State,County,Date,Time,Locale,Latitude,Longitude,Collector,"Life Stage","Collection Method","Preparation Type",Count,Temperature,Humidity,"Dew Point",Wind,"Wind Direction","Barometric Pressure",Sky,"Moon Phase",Notes
45136,,2014-045513,SPM025672,"Schinia rivulosa","Ragweed Flower Moth",Iowa,Jefferson,2011-08-11,,"Near Fairfield",41.0503,-92.024,"Moni Hayne",adult,Blacklight/Fluorescent,Photograph,1,,,,,,,,,
45144,,2014-045521,SPM031339,"Schinia rivulosa","Ragweed Flower Moth",Iowa,Linn,2012-08-18,,"Matsell Bridge Natural Area",42.13131,-91.38886,"Jim Durbin",adult,Blacklight/Fluorescent,Photograph,1,,,,,,,,,
45201,,2014-045578,SPM000345,"Schinia rivulosa","Ragweed Flower Moth",Iowa,Linn,2003-07-23,,"Wanatee County Park",42.0094,-91.56623,"Jim Durbin",adult,Blacklight/Fluorescent,Sighting,1,,,,,,,,,
45202,,2014-045579,SPM000346,"Schinia rivulosa","Ragweed Flower Moth",Iowa,Linn,2003-07-23,,"Wanatee County Park",42.0094,-91.56623,"Jim Durbin",adult,Blacklight/Fluorescent,Sighting,1,,,,,,,,,
45203,,2014-045580,SPM000347,"Schinia rivulosa","Ragweed Flower Moth",Iowa,Linn,2003-07-23,,"Wanatee County Park",42.0094,-91.56623,"Jim Durbin",adult,Blacklight/Fluorescent,Sighting,1,,,,,,,,,
45204,"Frank Olsen Drawer 04",2014-045581,SPM003044,"Schinia rivulosa","Ragweed Flower Moth",Iowa,Linn,2003-07-30,,"Wanatee County Park",42.00994,-91.57749,"Frank Olsen",adult,,Pinned,1,,,,,,,,,"Located at Iowa State"
45205,,2014-045582,SPM003804,"Schinia rivulosa","Ragweed Flower Moth",Iowa,Jasper,2003-05-15,,"Neal Smith National Wildlife Refuge",41.5678,-93.2675,"Keith Summerville",adult,,Pinned,1,,,,,,,,,
45206,"Jim Durbin Drawer 173",2014-045583,SPM005152,"Schinia rivulosa","Ragweed Flower Moth",Kentucky,Ohio,2005-08-27,,"Leon's Farm, Ohio County",37.42033,-86.77023,"Jim Durbin",adult,Blacklight/Fluorescent,Pinned,1,,,,,,,,,
45207,"Jim Durbin Drawer 173",2014-045584,SPM007054,"Schinia rivulosa","Ragweed Flower Moth",Kentucky,Ohio,2006-08-15,,"Leon's Farm, Ohio County",37.42033,-86.77023,"Jim Durbin",adult,Blacklight/Fluorescent,Pinned,1,,,,,,,,,
45208,"Jim Durbin Drawer 173",2014-045585,SPM007095,"Schinia rivulosa","Ragweed Flower Moth",Kentucky,Ohio,2006-08-15,,"Leon's Farm, Ohio County",37.42033,-86.77023,"Jim Durbin",adult,Blacklight/Fluorescent,Pinned,1,,,,,,,,,
45209,"Jim Durbin Drawer 173",2014-045586,SPM007106,"Schinia rivulosa","Ragweed Flower Moth",Kentucky,Ohio,2006-08-15,,"Leon's Farm, Ohio County",37.42033,-86.77023,"Jim Durbin",adult,Blacklight/Fluorescent,Pinned,1,,,,,,,,,
45210,"Jim Durbin Drawer 173",2014-045587,SPM007116,"Schinia rivulosa","Ragweed Flower Moth",Kentucky,Ohio,2006-08-15,,"Leon's Farm, Ohio County",37.42033,-86.77023,"Jim Durbin",adult,Blacklight/Fluorescent,Pinned,1,,,,,,,,,
45211,"Jim Durbin Drawer 173",2014-045588,SPM007287,"Schinia rivulosa","Ragweed Flower Moth",Iowa,Linn,2006-07-28,,"Pleasant Creek State Recreation Area, Linn County",42.11952,-91.81215,"Jim Durbin",adult,Blacklight/Fluorescent,Pinned,1,,,,,,,,,
45212,"Jim Durbin Drawer 173",2014-045589,SPM007288,"Schinia rivulosa","Ragweed Flower Moth",Iowa,Linn,2006-07-28,,"Pleasant Creek State Recreation Area, Linn County",42.11952,-91.81215,"Jim Durbin",adult,Blacklight/Fluorescent,Pinned,1,,,,,,,,,
45213,"Jim Durbin Drawer 173",2014-045590,SPM007291,"Schinia rivulosa","Ragweed Flower Moth",Iowa,Linn,2006-07-28,,"Pleasant Creek State Recreation Area, Linn County",42.11952,-91.81215,"Jim Durbin",adult,Blacklight/Fluorescent,Pinned,1,,,,,,,,,
45214,"Frank Olsen Drawer 04",2014-045591,SPM012829,"Schinia rivulosa","Ragweed Flower Moth",Iowa,Shelby,2008-07-30,,"Dinesen Prairie State Preserve",41.70877,-95.280825,"Frank Olsen",adult,,Pinned,1,,,,,,,,,"Located at Iowa State"
45215,"Jim Durbin Drawer 173",2014-045592,SPM015109,"Schinia rivulosa","Ragweed Flower Moth",Iowa,Fremont,2009-08-09,,"Waubonsie State Park",40.676,-95.689,"Jim Durbin",adult,Blacklight/Fluorescent,Pinned,1,,,,,,,,,
45216,"Jim Durbin Drawer 173",2014-045593,SPM015115,"Schinia rivulosa","Ragweed Flower Moth",Iowa,Fremont,2009-08-09,,"Waubonsie State Park",40.676,-95.689,"Jim Durbin",adult,Blacklight/Fluorescent,Pinned,1,,,,,,,,,
45217,"Jim Durbin Drawer 173",2014-045594,SPM018888,"Schinia rivulosa","Ragweed Flower Moth",Iowa,"Palo Alto",2010-08-06,,"Lost Island County Park",43.17582,-94.89189,"Jim Durbin",adult,Blacklight/Fluorescent,Pinned,1,,,,,,,,,
45218,,2014-045595,SPM019829,"Schinia rivulosa","Ragweed Flower Moth",Iowa,Johnson,2010-07-29,,"Iowa City Site 1",41.62806,-91.51417,"Mark Brown",adult,,Photograph,1,,,,,,,,,
45220,"Jim Durbin Drawer 173",2014-045597,SPM023412,"Schinia rivulosa","Ragweed Flower Moth",Kentucky,Daviess,2011-08-11,,"5031 Old Lyddane Bridge Road",37.746807,-87.185997,"Jim Durbin",adult,"Building Light",Pinned,1,,,,,,,,,
45221,,2014-045598,SPM031387,"Schinia rivulosa","Ragweed Flower Moth",Iowa,Linn,2012-08-18,,"Matsell Bridge Natural Area",42.13131,-91.38886,"Jim Durbin",adult,Blacklight/Fluorescent,Photograph,1,,,,,,,,,
45222,,2014-045599,SPM031646,"Schinia rivulosa","Ragweed Flower Moth",Kentucky,Daviess,2012-08-04,,"5031 Old Lyddane Bridge Road",37.746807,-87.185997,"Jim Durbin",adult,Blacklight/Fluorescent,Photograph,1,,,,,,,,,
45223,,2014-045600,SPM032393,"Schinia rivulosa","Ragweed Flower Moth",Iowa,Johnson,2012-08-22,,"Iowa City",41.667,-91.545,"Mark Brown",adult,,Photograph,1,,,,,,,,,
45224,"Frank Olsen Drawer 04",2014-045601,SPM032972,"Schinia rivulosa","Ragweed Flower Moth",Iowa,Linn,2012-08-14,,"Wickiup Hill Outdoor Learning Area",42.08398,-91.7651,"Frank Olsen",adult,,Pinned,1,,,,,,,,,"Located at Iowa State"
45225,"Frank Olsen Drawer 04",2014-045602,SPM036749,"Schinia rivulosa","Ragweed Flower Moth",Iowa,Linn,2013-07-29,,"Matsell Bridge Natural Area",42.13131,-91.38886,"Frank Olsen",adult,,Pinned,1,,,,,,,,,"Located at Iowa State"
45226,,2014-045603,SPM037190,"Schinia rivulosa","Ragweed Flower Moth",Iowa,Winneshiek,2011-08-22,,"100 Acre Wood-x",0,0,"MJ Hatfield",adult,,Photograph,1,,,,,,,,,
45227,"Frank Olsen Drawer 04",2014-045604,SPM037409,"Schinia rivulosa","Ragweed Flower Moth",Iowa,Guthrie,2013-08-21,,"Whiterock Conservancy",41.8201,-94.64768,"Frank Olsen",adult,,Pinned,1,,,,,,,,,"Located at Iowa State"
45228,,2014-045605,SPM037874,"Schinia rivulosa","Ragweed Flower Moth",Iowa,Jefferson,2009-08-11,,"Near Fairfield",41.0503,-92.024,"Moni Hayne",adult,Blacklight/Fluorescent,Photograph,1,,,,,,,,,
49889,"Jim Durbin Drawer 173",2014-050270,,"Schinia rivulosa","Ragweed Flower Moth",Iowa,Linn,2014-08-13,,"Pleasant Creek State Recreation Area, Linn County",42.110327,-91.822988,"Jim Durbin",adult,Blacklight/Fluorescent,Pinned,1,,,,,,,,,
69171,,2014-069778,,"Schinia rivulosa","Ragweed Flower Moth",Iowa,Kossuth,2014-07-23,,Algona,43.06998,-94.23295,"Matt Kenne",adult,,Sighting,1,,,,,,,,,
109091,"Frank Olsen Drawer 04",2014-109481,,"Schinia rivulosa","Ragweed Flower Moth",Iowa,Clarke,2014-08-22,,"Red Fern Timber",40.98317,-93.75317,"Frank Olsen",adult,,Pinned,1,,,,,,,,,"Located at Iowa State"
109092,"Frank Olsen Drawer 04",2014-109482,,"Schinia rivulosa","Ragweed Flower Moth",Iowa,Clarke,2014-08-22,,"Red Fern Timber",40.98317,-93.75317,"Frank Olsen",adult,,Pinned,1,,,,,,,,,"Located at Iowa State"
132401,,2015-022992,,"Schinia rivulosa","Ragweed Flower Moth",Iowa,Story,2015-09-01,,"Ames, Paul",42.02064,-93.623952,"Paul Martsching",adult,"Building Light",Sighting,1,,,,,,,,,
132402,,2015-022993,,"Schinia rivulosa","Ragweed Flower Moth",Iowa,Story,2015-09-02,,"Ames, Paul",42.02064,-93.623952,"Paul Martsching",adult,"Building Light",Sighting,1,,,,,,,,,
132403,"Paul Martsching Collection",2015-022994,,"Schinia rivulosa","Ragweed Flower Moth",Iowa,Story,2015-09-03,,"Ames, Paul",42.02064,-93.623952,"Paul Martsching",adult,"Building Light",Pinned,1,,,,,,,,,
137086,,2016-001628,,"Schinia rivulosa","Ragweed Flower Moth",Iowa,Story,2003-08-18,,"Ames, Paul",42.02064,-93.623952,"Paul Martsching",adult,"Building Light",Photograph,1,,,,,,,,,
137087,,2016-001629,,"Schinia rivulosa","Ragweed Flower Moth",Iowa,Story,2003-08-24,,"Ames, Paul",42.02064,-93.623952,"Paul Martsching",adult,"Building Light",Photograph,1,,,,,,,,,
137088,,2016-001630,,"Schinia rivulosa","Ragweed Flower Moth",Iowa,Story,2003-08-24,,"Ames, Paul",42.02064,-93.623952,"Paul Martsching",adult,"Building Light",Photograph,1,,,,,,,,,
137089,,2016-001631,,"Schinia rivulosa","Ragweed Flower Moth",Iowa,Story,2006-08-24,,"Ames, Paul",42.02064,-93.623952,"Paul Martsching",adult,"Building Light",Photograph,1,,,,,,,,,
176012,"Paul Martsching Collection",2016-040762,,"Schinia rivulosa","Ragweed Flower Moth",Iowa,Story,2016-08-09,,"Ames, Paul",42.02064,-93.623952,"Paul Martsching",adult,"Building Light",Pinned,1,,,,,,,,,
177031,"Paul Martsching Collection",2016-041781,,"Schinia rivulosa","Ragweed Flower Moth",Iowa,Story,2016-08-23,,"Ames, Paul",42.02064,-93.623952,"Paul Martsching",adult,"Building Light",Pinned,1,,,,,,,,,
180034,,2016-044784,,"Schinia rivulosa","Ragweed Flower Moth",Iowa,Story,2016-08-14,,"Ames, Paul",42.02064,-93.623952,"Paul Martsching",adult,"Building Light",Sighting,1,,,,,,,,,"14 Aug 2016 84/66; mostly clear; wind: calm > ~3 mph.  15 Aug 1245-300 am CDST; 63/63; calm > N 3 mph; mostly clear; 3/4 lit Moon.  Still plenty of crickets; maybe only ten crickets per moth now"
180035,,2016-044785,,"Schinia rivulosa","Ragweed Flower Moth",Iowa,Story,2016-08-22,,"Ames, Paul",42.02064,-93.623952,"Paul Martsching",adult,"Building Light",Sighting,1,,,,,,,,,"22 Aug 2016 81/63 mostly clear; strong & gusty S wind.  1245-315 am CDST 23 Aug 65 deg; wind S 10 mph; 2/3 lit Moon; cirrus sky."
195250,,2017-013214,,"Schinia rivulosa","Ragweed Flower Moth",Iowa,Linn,2017-08-14,2030-2300,"Hitaga Sand Ridge Prairie Preserve",42.250957,-91.632098,"Jim Durbin",adult,Blacklight/Fluorescent,Photograph,1,72,97,71,0,0,29.81,clear,"60% visible",
198662,"Paul Martsching Collection",2017-016596,,"Schinia rivulosa","Ragweed Flower Moth",Iowa,Story,2017-08-27,,"Ames, Paul",42.02064,-93.623952,"Paul Martsching",adult,"Building Light",Pinned,1,,,,,,,,,
198663,,2017-016597,,"Schinia rivulosa","Ragweed Flower Moth",Iowa,Story,2017-08-28,,"Ames, Paul",42.02064,-93.623952,"Paul Martsching",adult,"Building Light",Sighting,1,,,,,,,,,
198664,,2017-016598,,"Schinia rivulosa","Ragweed Flower Moth",Iowa,Story,2017-08-31,,"Ames, Paul",42.02064,-93.623952,"Paul Martsching",adult,"Building Light",Sighting,1,,,,,,,,,
198665,,2017-016599,,"Schinia rivulosa","Ragweed Flower Moth",Iowa,Story,2017-09-25,,"Ames, Paul",42.02064,-93.623952,"Paul Martsching",adult,"Building Light",Sighting,1,,,,,,,,,
207783,,2018-005948,,"Schinia rivulosa","Ragweed Flower Moth",Iowa,Story,2003-08-01,,"Ames, Paul",42.02064,-93.623952,"Paul Martsching",adult,"Building Light",Sighting,8,,,,,,,,,
207784,,2018-005949,,"Schinia rivulosa","Ragweed Flower Moth",Iowa,Story,2003-08-26,,"Ames, Paul",42.02064,-93.623952,"Paul Martsching",adult,"Building Light",Sighting,8,,,,,,,,,
207785,,2018-005950,,"Schinia rivulosa","Ragweed Flower Moth",Iowa,Story,2004-07-19,,"Ames, Paul",42.02064,-93.623952,"Paul Martsching",adult,"Building Light",Sighting,5,,,,,,,,,
207786,,2018-005951,,"Schinia rivulosa","Ragweed Flower Moth",Iowa,Story,2004-08-31,,"Ames, Paul",42.02064,-93.623952,"Paul Martsching",adult,"Building Light",Sighting,21,,,,,,,,,
207787,,2018-005952,,"Schinia rivulosa","Ragweed Flower Moth",Iowa,Story,2005-07-30,,"Ames, Paul",42.02064,-93.623952,"Paul Martsching",adult,"Building Light",Sighting,1,,,,,,,,,
207788,,2018-005953,,"Schinia rivulosa","Ragweed Flower Moth",Iowa,Story,2005-08-21,,"Ames, Paul",42.02064,-93.623952,"Paul Martsching",adult,"Building Light",Sighting,5,,,,,,,,,
207789,,2018-005954,,"Schinia rivulosa","Ragweed Flower Moth",Iowa,Story,2006-08-04,,"Ames, Paul",42.02064,-93.623952,"Paul Martsching",adult,"Building Light",Sighting,2,,,,,,,,,
207790,,2018-005955,,"Schinia rivulosa","Ragweed Flower Moth",Iowa,Story,2006-08-24,,"Ames, Paul",42.02064,-93.623952,"Paul Martsching",adult,"Building Light",Sighting,3,,,,,,,,,
207791,,2018-005956,,"Schinia rivulosa","Ragweed Flower Moth",Iowa,Story,2007-08-13,,"Ames, Paul",42.02064,-93.623952,"Paul Martsching",adult,"Building Light",Sighting,3,,,,,,,,,
207792,,2018-005957,,"Schinia rivulosa","Ragweed Flower Moth",Iowa,Story,2007-10-05,,"Ames, Paul",42.02064,-93.623952,"Paul Martsching",adult,"Building Light",Sighting,1,,,,,,,,,
207793,,2018-005958,,"Schinia rivulosa","Ragweed Flower Moth",Iowa,Story,2008-08-15,,"Ames, Paul",42.02064,-93.623952,"Paul Martsching",adult,"Building Light",Sighting,7,,,,,,,,,
207794,,2018-005959,,"Schinia rivulosa","Ragweed Flower Moth",Iowa,Story,2008-09-03,,"Ames, Paul",42.02064,-93.623952,"Paul Martsching",adult,"Building Light",Sighting,18,,,,,,,,,
207795,,2018-005960,,"Schinia rivulosa","Ragweed Flower Moth",Iowa,Story,2009-08-12,,"Ames, Paul",42.02064,-93.623952,"Paul Martsching",adult,"Building Light",Sighting,2,,,,,,,,,
207796,,2018-005961,,"Schinia rivulosa","Ragweed Flower Moth",Iowa,Story,2009-08-17,,"Ames, Paul",42.02064,-93.623952,"Paul Martsching",adult,"Building Light",Sighting,2,,,,,,,,,
207797,,2018-005962,,"Schinia rivulosa","Ragweed Flower Moth",Iowa,Story,2011-08-24,,"Ames, Paul",42.02064,-93.623952,"Paul Martsching",adult,"Building Light",Sighting,1,,,,,,,,,
207798,,2018-005963,,"Schinia rivulosa","Ragweed Flower Moth",Iowa,Story,2011-08-27,,"Ames, Paul",42.02064,-93.623952,"Paul Martsching",adult,"Building Light",Sighting,1,,,,,,,,,
207799,,2018-005964,,"Schinia rivulosa","Ragweed Flower Moth",Iowa,Story,2014-07-23,,"Ames, Paul",42.02064,-93.623952,"Paul Martsching",adult,"Building Light",Sighting,1,,,,,,,,,
207800,,2018-005965,,"Schinia rivulosa","Ragweed Flower Moth",Iowa,Story,2014-08-15,,"Ames, Paul",42.02064,-93.623952,"Paul Martsching",adult,"Building Light",Sighting,8,,,,,,,,,
207801,,2018-005966,,"Schinia rivulosa","Ragweed Flower Moth",Iowa,Story,2014-09-01,,"Ames, Paul",42.02064,-93.623952,"Paul Martsching",adult,"Building Light",Sighting,1,,,,,,,,,
219248,"Frank Olsen Drawer 04",2018-017404,,"Schinia rivulosa","Ragweed Flower Moth",Iowa,Clarke,2018-08-12,,Redacted,Redacted,Redacted,"Frank Olsen",adult,,Pinned,1,,,,,,,,,"Located at Iowa State"
222549,"Paul Martsching Collection",2018-020703,,"Schinia rivulosa","Ragweed Flower Moth",Iowa,Story,2018-08-03,,"Ames, Paul",42.02064,-93.623952,"Paul Martsching",adult,"Building Light",Pinned,1,,,,,,,,,
224552,,2018-022691,,"Schinia rivulosa","Ragweed Flower Moth",Iowa,Appanoose,2018-08-05,,"Sundown Lake Recreation Area",40.830089,-92.747939,"Eric Liskey",adult,,Photograph,1,,,,,,,,,
224572,,2018-022713,,"Schinia rivulosa","Ragweed Flower Moth",Iowa,Appanoose,2018-08-11,,"Sundown Lake Recreation Area",40.830089,-92.747939,"Eric Liskey",adult,,Photograph,1,,,,,,,,,
227542,,2019-002262,,"Schinia rivulosa","Ragweed Flower Moth",Iowa,Story,2018-08-03,,"Ames, Paul",42.02064,-93.623952,"Paul Martsching",adult,"Building Light",Sighting,3,,,,,,,,,
227543,,2019-002263,,"Schinia rivulosa","Ragweed Flower Moth",Iowa,Story,2018-08-07,,"Ames, Paul",42.02064,-93.623952,"Paul Martsching",adult,"Building Light",Sighting,1,,,,,,,,,
227544,,2019-002264,,"Schinia rivulosa","Ragweed Flower Moth",Iowa,Story,2018-08-08,,"Ames, Paul",42.02064,-93.623952,"Paul Martsching",adult,"Building Light",Sighting,2,,,,,,,,,
227545,,2019-002265,,"Schinia rivulosa","Ragweed Flower Moth",Iowa,Story,2018-08-14,,"Ames, Paul",42.02064,-93.623952,"Paul Martsching",adult,"Building Light",Sighting,1,,,,,,,,,
227546,,2019-002266,,"Schinia rivulosa","Ragweed Flower Moth",Iowa,Story,2018-08-18,,"Ames, Paul",42.02064,-93.623952,"Paul Martsching",adult,"Building Light",Sighting,1,,,,,,,,,
227547,,2019-002267,,"Schinia rivulosa","Ragweed Flower Moth",Iowa,Story,2018-08-30,,"Ames, Paul",42.02064,-93.623952,"Paul Martsching",adult,"Building Light",Sighting,1,,,,,,,,,
228910,"Frank Olsen Drawer 04",2019-003636,,"Schinia rivulosa","Ragweed Flower Moth",Iowa,Clarke,2014-08-22,,"Red Fern Timber",40.98317,-93.75317,"Frank Olsen",adult,,Pinned,1,,,,,,,,,"Located at Iowa State"
228911,"Frank Olsen Drawer 04",2019-003637,,"Schinia rivulosa","Ragweed Flower Moth",Iowa,Clarke,2014-08-22,,"Red Fern Timber",40.98317,-93.75317,"Frank Olsen",adult,,Pinned,1,,,,,,,,,"Located at Iowa State"
244781,,,,"Schinia rivulosa","Ragweed Flower Moth",Iowa,Story,2019-08-05,3:30,"Ames, Paul",42.02064,-93.623952,"Paul Martsching",adult,"Building Light",Sighting,2,,,,,,,,,
244782,,,,"Schinia rivulosa","Ragweed Flower Moth",Iowa,Story,2019-08-29,3:30,"Ames, Paul",42.02064,-93.623952,"Paul Martsching",adult,"Building Light",Sighting,1,,,,,,,,,
244783,,,,"Schinia rivulosa","Ragweed Flower Moth",Iowa,Story,2019-09-03,3:30,"Ames, Paul",42.02064,-93.623952,"Paul Martsching",adult,"Building Light",Sighting,1,,,,,,,,,
246144,,,,"Schinia rivulosa","Ragweed Flower Moth",Iowa,Story,2019-08-05,3:30,"Ames, Paul",42.02064,-93.623952,"Paul Martsching",adult,"Building Light",Sighting,2,,,,,,,,,
246145,,,,"Schinia rivulosa","Ragweed Flower Moth",Iowa,Story,2019-08-29,3:30,"Ames, Paul",42.02064,-93.623952,"Paul Martsching",adult,"Building Light",Sighting,1,,,,,,,,,
246146,,,,"Schinia rivulosa","Ragweed Flower Moth",Iowa,Story,2019-09-03,3:30,"Ames, Paul",42.02064,-93.623952,"Paul Martsching",adult,"Building Light",Sighting,1,,,,,,,,,
269693,,,,"Schinia rivulosa","Ragweed Flower Moth",Iowa,Linn,2020-08-08,22:54:06,"Hitaga Sand Ridge Prairie Preserve",42.25088607,-91.63213435,"Jim Durbin",adult,Blacklight/Fluorescent,Photograph,1,78,81,71,7,180,30.02,clear,"80% visible",
269703,,,,"Schinia rivulosa","Ragweed Flower Moth",Iowa,Linn,2020-08-08,22:51:46,"Hitaga Sand Ridge Prairie Preserve",42.25088607,-91.63213435,"Jim Durbin",adult,Blacklight/Fluorescent,Photograph,1,78,81,71,7,180,30.02,clear,"80% visible",
269716,,,,"Schinia rivulosa","Ragweed Flower Moth",Iowa,Linn,2020-08-08,22:48:14,"Hitaga Sand Ridge Prairie Preserve",42.25088607,-91.63213435,"Jim Durbin",adult,Blacklight/Fluorescent,Photograph,1,78,81,71,7,180,30.02,clear,"80% visible",
269720,,,,"Schinia rivulosa","Ragweed Flower Moth",Iowa,Linn,2020-08-08,22:46:52,"Hitaga Sand Ridge Prairie Preserve",42.25088607,-91.63213435,"Jim Durbin",adult,Blacklight/Fluorescent,Photograph,1,78,81,71,7,180,30.02,clear,"80% visible",
269813,,,,"Schinia rivulosa","Ragweed Flower Moth",Iowa,Linn,2020-08-08,22:16:38,"Hitaga Sand Ridge Prairie Preserve",42.25088607,-91.63213435,"Jim Durbin",adult,Blacklight/Fluorescent,Photograph,1,78,81,71,7,180,30.02,clear,"80% visible",
269844,,,,"Schinia rivulosa","Ragweed Flower Moth",Iowa,Linn,2020-08-08,21:58:31,"Hitaga Sand Ridge Prairie Preserve",42.25088607,-91.63213435,"Jim Durbin",adult,Blacklight/Fluorescent,Photograph,1,78,81,71,7,180,30.02,clear,"80% visible",
269852,,,,"Schinia rivulosa","Ragweed Flower Moth",Iowa,Linn,2020-08-08,21:54:08,"Hitaga Sand Ridge Prairie Preserve",42.25088607,-91.63213435,"Jim Durbin",adult,Blacklight/Fluorescent,Photograph,1,78,81,71,7,180,30.02,clear,"80% visible",
269853,,,,"Schinia rivulosa","Ragweed Flower Moth",Iowa,Linn,2020-08-08,21:54:52,"Hitaga Sand Ridge Prairie Preserve",42.25088607,-91.63213435,"Jim Durbin",adult,Blacklight/Fluorescent,Photograph,1,78,81,71,7,180,30.02,clear,"80% visible",
282176,,,,"Schinia rivulosa","Ragweed Flower Moth",Iowa,Story,2020-07-25,,"Ames, Paul",42.011454,-93.615063,"Paul Martsching",adult,"Building Light",Sighting,1,,,,,,,,,
282177,,,,"Schinia rivulosa","Ragweed Flower Moth",Iowa,Story,2020-07-29,,"Ames, Paul",42.011454,-93.615063,"Paul Martsching",adult,"Building Light",Sighting,1,,,,,,,,,
282178,,,,"Schinia rivulosa","Ragweed Flower Moth",Iowa,Story,2020-08-08,,"Ames, Paul",42.011454,-93.615063,"Paul Martsching",adult,"Building Light",Sighting,1,,,,,,,,,
282179,,,,"Schinia rivulosa","Ragweed Flower Moth",Iowa,Story,2020-08-09,,"Ames, Paul",42.011454,-93.615063,"Paul Martsching",adult,"Building Light",Sighting,1,,,,,,,,,
282180,,,,"Schinia rivulosa","Ragweed Flower Moth",Iowa,Story,2020-08-14,,"Ames, Paul",42.011454,-93.615063,"Paul Martsching",adult,"Building Light",Sighting,6,,,,,,,,,
282181,,,,"Schinia rivulosa","Ragweed Flower Moth",Iowa,Story,2020-08-16,,"Ames, Paul",42.011454,-93.615063,"Paul Martsching",adult,"Building Light",Sighting,1,,,,,,,,,
282182,,,,"Schinia rivulosa","Ragweed Flower Moth",Iowa,Story,2020-08-20,,"Ames, Paul",42.011454,-93.615063,"Paul Martsching",adult,"Building Light",Sighting,1,,,,,,,,,
282183,,,,"Schinia rivulosa","Ragweed Flower Moth",Iowa,Story,2020-08-22,,"Ames, Paul",42.011454,-93.615063,"Paul Martsching",adult,"Building Light",Sighting,3,,,,,,,,,
282184,,,,"Schinia rivulosa","Ragweed Flower Moth",Iowa,Story,2020-08-24,,"Ames, Paul",42.011454,-93.615063,"Paul Martsching",adult,"Building Light",Sighting,1,,,,,,,,,
282185,,,,"Schinia rivulosa","Ragweed Flower Moth",Iowa,Story,2020-08-25,,"Ames, Paul",42.011454,-93.615063,"Paul Martsching",adult,"Building Light",Sighting,4,,,,,,,,,
282186,,,,"Schinia rivulosa","Ragweed Flower Moth",Iowa,Story,2020-08-26,,"Ames, Paul",42.011454,-93.615063,"Paul Martsching",adult,"Building Light",Sighting,5,,,,,,,,,
282187,,,,"Schinia rivulosa","Ragweed Flower Moth",Iowa,Story,2020-08-27,,"Ames, Paul",42.011454,-93.615063,"Paul Martsching",adult,"Building Light",Sighting,2,,,,,,,,,
286966,,,,"Schinia rivulosa","Ragweed Flower Moth",Iowa,Jefferson,2020-07-22,21:29:46,"Near Fairfield",41.05009748,-92.02398156,"Moni Hayne",adult,Blacklight/Fluorescent,Photograph,1,,,,,,,,,
291221,"jim durbin drawer 173",2021-000121,,"Schinia rivulosa","Ragweed Flower Moth",Iowa,Linn,2021-08-06,22:18:14,"Hitaga Sand Ridge Prairie Preserve",42.25082292,-91.63215158,"Jim Durbin",adult,Blacklight/Fluorescent,Pinned,1,78,72,68,4,165,29.79,cloudy,"new moon",
298235,,,,"Schinia rivulosa","Ragweed Flower Moth",Iowa,Johnson,2021-08-07,,"MacBride Nature Recreation Area",41.786929,-91.56845,"Mark Brown",adult,Sighting,Photograph,1,,,,,,,,,
298246,,,,"Schinia rivulosa","Ragweed Flower Moth",Iowa,Johnson,2021-08-09,,"MacBride Nature Recreation Area",41.786865,-91.568407,"Mark Brown",adult,Sighting,Photograph,1,,,,,,,,,
298693,,,,"Schinia rivulosa","Ragweed Flower Moth",Iowa,Story,2021-08-07,0500,"Ames, Paul",42.011732,-93.615039,"Paul Martsching",adult,Sighting,Sighting,7,73,,,5,225,,overcast,,
309362,"Jim Durbin Drawer 173",2022-000614,,"Schinia rivulosa","Ragweed Flower Moth",Iowa,Clarke,2018-08-12,,Redacted,Redacted,Redacted,"Frank Olsen",adult,Blacklighting,Pinned,1,,,,,,,,,
315014,,,SPM019828,"Schinia rivulosa","Ragweed Flower Moth",Iowa,Johnson,2010-07-29,,"Iowa City Site 1",41.62806,-91.51417,"Mark Brown",adult,Sighting,Photograph,1,,,,,,,,,
316145,,,,"Schinia rivulosa","Ragweed Flower Moth",Iowa,Johnson,2022-08-22,,"Willow Creek/Kiwanis Park",41.647924,-91.569677,"Peter Hansen",adult,Sighting,Photograph,1,,,,,,,,,
321450,,,,"Schinia rivulosa","Ragweed Flower Moth",Iowa,Story,2022-08-06,0530,"Ames, Paul",42.011954,-93.615226,"Paul Martsching",adult,"Building Light",Sighting,2,70,,69,135,6,,,,
321475,,,,"Schinia rivulosa","Ragweed Flower Moth",Iowa,Story,2022-08-24,0600,"Ames, Paul",42.011954,-93.615226,"Paul Martsching",adult,"Building Light",Sighting,1,63,,,0,0,,"partly cloudy",,
321502,,,,"Schinia rivulosa","Ragweed Flower Moth",Iowa,Story,2022-08-26,600,"Ames, Paul",42.011954,-93.615226,"Paul Martsching",adult,"Building Light",Sighting,2,63,,62,135,6,,"partly cloudy",,
330970,,,,"Schinia rivulosa","Ragweed Flower Moth",Iowa,Johnson,2022-08-05,,"MacBride Nature Recreation Area",41.786889,-91.568575,"Mark Brown",adult,Sighting,Photograph,1,,,,,,,,,
332209,,,,"Schinia rivulosa","Ragweed Flower Moth",Iowa,Johnson,2022-08-22,05:54:24,Redacted,Redacted,Redacted,"Mark Brown",adult,Sighting,Photograph,1,,,,,,,,,
332254,,,,"Schinia rivulosa","Ragweed Flower Moth",Iowa,Johnson,2022-08-18,22:51:54,Redacted,Redacted,Redacted,"Mark Brown",adult,Sighting,Photograph,1,,,,,,,,,