ID,"Collection / Source","Catalog Number","Specify Number",Taxon,"Common Name",State,County,Date,Time,Locale,Latitude,Longitude,Collector,"Life Stage","Collection Method","Preparation Type",Count,Temperature,Humidity,"Dew Point",Wind,"Wind Direction","Barometric Pressure",Sky,"Moon Phase",Notes
14312,"Frank Olsen Drawer 06",2014-014598,SPM005437,"Agrotis gladiaria","Swordsman Dart",Iowa,Dubuque,2005-10-03,,"Mines of Spain State Recreational Area",42.4453,-90.62293,"Frank Olsen",adult,,Pinned,1,,,,,,,,,"Located at Iowa State"
14313,"Frank Olsen Drawer 06",2014-014599,SPM005438,"Agrotis gladiaria","Swordsman Dart",Iowa,Linn,2005-09-27,,"Palisades Kepler State Park",41.90833,-91.50238,"Frank Olsen",adult,,Pinned,1,,,,,,,,,"Located at Iowa State"
14314,"Frank Olsen Drawer 06",2014-014600,SPM005439,"Agrotis gladiaria","Swordsman Dart",Iowa,Linn,2005-09-27,,"Palisades Kepler State Park",41.90833,-91.50238,"Frank Olsen",adult,,Pinned,1,,,,,,,,,"Located at Iowa State"
14315,"Frank Olsen Drawer 06",2014-014601,SPM007666,"Agrotis gladiaria","Swordsman Dart",Iowa,Linn,2006-09-22,,"Wanatee County Park",42.00994,-91.57749,"Frank Olsen",adult,,Pinned,1,,,,,,,,,"Located at Iowa State"
14316,"Frank Olsen Drawer 06",2014-014602,SPM007667,"Agrotis gladiaria","Swordsman Dart",Iowa,Linn,2006-09-22,,"Wanatee County Park",42.00994,-91.57749,"Frank Olsen",adult,,Pinned,1,,,,,,,,,"Located at Iowa State"
14317,"Jim Durbin Drawer 165",2014-014603,SPM009343,"Agrotis gladiaria","Swordsman Dart",Iowa,Linn,2007-08-21,,"Wickiup Hill Outdoor Learning Area",42.08398,-91.7651,"Jim Durbin",adult,Blacklight/Fluorescent,Pinned,1,,,,,,,,,
14318,"Jim Durbin Drawer 165",2014-014604,SPM009837,"Agrotis gladiaria","Swordsman Dart",Iowa,Linn,2007-09-17,,"1460 Douglas Ct, Marion",42.040069,-91.590953,"Jim Durbin",adult,Blacklight/Fluorescent,Pinned,1,,,,,,,,,
14319,"Jim Durbin Drawer 165",2014-014605,SPM009838,"Agrotis gladiaria","Swordsman Dart",Iowa,Linn,2007-09-17,,"1460 Douglas Ct, Marion",42.040069,-91.590953,"Jim Durbin",adult,Blacklight/Fluorescent,Pinned,1,,,,,,,,,
14320,"Jim Durbin Drawer 165",2014-014606,SPM009843,"Agrotis gladiaria","Swordsman Dart",Iowa,Linn,2007-09-17,,"1460 Douglas Ct, Marion",42.040069,-91.590953,"Jim Durbin",adult,Blacklight/Fluorescent,Pinned,1,,,,,,,,,
14321,"Jim Durbin Drawer 165",2014-014607,SPM010224,"Agrotis gladiaria","Swordsman Dart",Kentucky,Ohio,2007-10-16,,"Leon's Farm, Ohio County",37.42033,-86.77023,"Jim Durbin",adult,Blacklight/Fluorescent,Pinned,1,,,,,,,,,
14322,"Jim Durbin Drawer 165",2014-014608,SPM010226,"Agrotis gladiaria","Swordsman Dart",Kentucky,Ohio,2007-10-16,,"Leon's Farm, Ohio County",37.42033,-86.77023,"Jim Durbin",adult,Blacklight/Fluorescent,Pinned,1,,,,,,,,,
14323,"Jim Durbin Drawer 165",2014-014609,SPM010231,"Agrotis gladiaria","Swordsman Dart",Kentucky,Ohio,2007-10-16,,"Leon's Farm, Ohio County",37.42033,-86.77023,"Jim Durbin",adult,Blacklight/Fluorescent,Pinned,1,,,,,,,,,
14324,"Jim Durbin Drawer 165",2014-014610,SPM010235,"Agrotis gladiaria","Swordsman Dart",Kentucky,Ohio,2007-10-16,,"Leon's Farm, Ohio County",37.42033,-86.77023,"Jim Durbin",adult,Blacklight/Fluorescent,Pinned,1,,,,,,,,,
14325,"Jim Durbin Drawer 165",2014-014611,SPM010252,"Agrotis gladiaria","Swordsman Dart",Kentucky,Ohio,2007-10-16,,"Leon's Farm, Ohio County",37.42033,-86.77023,"Jim Durbin",adult,Blacklight/Fluorescent,Pinned,1,,,,,,,,,
14326,"Jim Durbin Drawer 165",2014-014612,SPM010256,"Agrotis gladiaria","Swordsman Dart",Kentucky,Ohio,2007-10-16,,"Leon's Farm, Ohio County",37.42033,-86.77023,"Jim Durbin",adult,Blacklight/Fluorescent,Pinned,1,,,,,,,,,
14327,"Jim Durbin Drawer 165",2014-014613,SPM010258,"Agrotis gladiaria","Swordsman Dart",Kentucky,Ohio,2007-10-16,,"Leon's Farm, Ohio County",37.42033,-86.77023,"Jim Durbin",adult,Blacklight/Fluorescent,Pinned,1,,,,,,,,,
14328,"Jim Durbin Drawer 165",2014-014614,SPM010271,"Agrotis gladiaria","Swordsman Dart",Kentucky,Ohio,2007-10-16,,"Leon's Farm, Ohio County",37.42033,-86.77023,"Jim Durbin",adult,Blacklight/Fluorescent,Pinned,1,,,,,,,,,
14329,"Jim Durbin Drawer 165",2014-014615,SPM012604,"Agrotis gladiaria","Swordsman Dart",Iowa,Linn,2008-09-25,,"Behren's Pond Woodland State Preserve",42.118214,-91.754324,"Jim Durbin",adult,Blacklight/Fluorescent,Pinned,1,,,,,,,,,
14330,"Jim Durbin Drawer 165",2014-014616,SPM019752,"Agrotis gladiaria","Swordsman Dart",Iowa,Linn,2010-09-21,,"1460 Douglas Ct, Marion",42.040069,-91.590953,"Jim Durbin",adult,Blacklight/Fluorescent,Pinned,1,,,,,,,,,
14331,"Jim Durbin Drawer 165",2014-014617,SPM019790,"Agrotis gladiaria","Swordsman Dart",Iowa,Linn,2010-10-02,,"Rock Island Botanical State Preserve",42.02732,-91.72723,"Tom Jantscher",adult,,Pinned,1,,,,,,,,,
14332,"Frank Olsen Drawer 06",2014-014618,SPM020264,"Agrotis gladiaria","Swordsman Dart",Iowa,"Black Hawk",2010-09-12,,"Cedar Hills Sand Prairie Preserve",42.59305,-92.55315,"Frank Olsen",adult,,Pinned,1,,,,,,,,,"Located at Iowa State"
14333,,2014-014619,SPM032384,"Agrotis gladiaria","Swordsman Dart",Iowa,Johnson,2012-09-15,,"Iowa City",41.667,-91.545,"Mark Brown",adult,,Photograph,1,,,,,,,,,
14334,"Frank Olsen Drawer 06",2014-014620,SPM036739,"Agrotis gladiaria","Swordsman Dart",Iowa,Dubuque,2012-09-12,,"Catfish Creek State Preserve",42.4679,-90.6553,"Frank Olsen",adult,,Pinned,1,,,,,,,,,"Located at Iowa State"
14335,,2014-014621,SPM038680,"Agrotis gladiaria","Swordsman Dart",Iowa,Johnson,2013-09-26,,Redacted,Redacted,Redacted,"Mark Brown",adult,,Photograph,1,,,,,,,,,
27649,,2014-028002,SPM017135,"Agrotis gladiaria","Swordsman Dart",Iowa,Winneshiek,2007-09-24,,"Luther College",43.31333,-91.80306,"Ryan G",adult,,Pinned,1,,,,,,,,,
27650,,2014-028003,SPM017136,"Agrotis gladiaria","Swordsman Dart",Iowa,Winneshiek,2007-09-29,,"Luther College",43.31333,-91.80306,"Ryan G",adult,,Pinned,1,,,,,,,,,
27667,,2014-028020,SPM000268,"Agrotis gladiaria","Swordsman Dart",Iowa,Linn,2003-08-14,,"Wanatee County Park",42.0094,-91.56623,"Jim Durbin",adult,Blacklight/Fluorescent,Pinned,1,,,,,,,,,
65898,,2014-066502,,"Agrotis gladiaria","Swordsman Dart",Kentucky,Daviess,2014-10-01,,"5031 Old Lyddane Bridge Road",37.746807,-87.185997,"Jim Durbin",adult,Blacklight/Fluorescent,Photograph,1,,,,,,,,,
65948,,2014-066552,,"Agrotis gladiaria","Swordsman Dart",Missouri,Lincoln,2014-09-26,,"Cuivre River State Park",39.029456,-90.913147,"Jim Durbin",adult,Blacklight/Fluorescent,Photograph,1,,,,,,,,,
111739,,2015-002295,,"Agrotis gladiaria","Swordsman Dart",Iowa,Polk,2013-09-19,,Redacted,Redacted,Redacted,"Aaron Brees",adult,,Sighting,1,,,,,,,,,
111740,,2015-002296,,"Agrotis gladiaria","Swordsman Dart",Iowa,Polk,2013-09-20,,Redacted,Redacted,Redacted,"Aaron Brees",adult,,Sighting,1,,,,,,,,,
111741,,2015-002297,,"Agrotis gladiaria","Swordsman Dart",Iowa,Polk,2013-09-22,,Redacted,Redacted,Redacted,"Aaron Brees",adult,,Sighting,1,,,,,,,,,
111742,,2015-002298,,"Agrotis gladiaria","Swordsman Dart",Iowa,Polk,2013-09-23,,Redacted,Redacted,Redacted,"Aaron Brees",adult,,Sighting,1,,,,,,,,,
132331,,2015-022922,,"Agrotis gladiaria","Swordsman Dart",Iowa,Story,2015-09-15,,"Ames, Paul",42.02064,-93.623952,"Paul Martsching",adult,"Building Light",Sighting,2,,,,,,,,,
132332,,2015-022923,,"Agrotis gladiaria","Swordsman Dart",Iowa,Story,2015-09-16,,"Ames, Paul",42.02064,-93.623952,"Paul Martsching",adult,"Building Light",Sighting,1,,,,,,,,,
132333,"Paul Martsching Collection",2015-022924,,"Agrotis gladiaria","Swordsman Dart",Iowa,Story,2015-09-21,,"Ames, Paul",42.02064,-93.623952,"Paul Martsching",adult,"Building Light",Pinned,2,,,,,,,,,
132334,,2015-022925,,"Agrotis gladiaria","Swordsman Dart",Iowa,Story,2015-09-22,,"Ames, Paul",42.02064,-93.623952,"Paul Martsching",adult,"Building Light",Sighting,1,,,,,,,,,
132335,,2015-022926,,"Agrotis gladiaria","Swordsman Dart",Iowa,Story,2015-09-14,,"Ames, Paul",42.02064,-93.623952,"Paul Martsching",adult,"Building Light",Sighting,3,,,,,,,,,
132470,"Paul Martsching Collection",2015-023061,,"Agrotis gladiaria","Swordsman Dart",Iowa,Story,2015-09-21,,"Ames, Paul",42.02064,-93.623952,"Paul Martsching",adult,"Building Light",Pinned,1,,,,,,,,,
136832,,2016-001374,,"Agrotis gladiaria","Swordsman Dart",Iowa,Story,2003-09-17,,"Ames, Paul",42.02064,-93.623952,"Paul Martsching",adult,"Building Light",Photograph,1,,,,,,,,,
136833,,2016-001375,,"Agrotis gladiaria","Swordsman Dart",Iowa,Story,2003-09-25,,"Ames, Paul",42.02064,-93.623952,"Paul Martsching",adult,"Building Light",Photograph,1,,,,,,,,,
136834,,2016-001376,,"Agrotis gladiaria","Swordsman Dart",Iowa,Story,2003-10-10,,"Ames, Paul",42.02064,-93.623952,"Paul Martsching",adult,"Building Light",Photograph,1,,,,,,,,,
179827,,2016-044577,,"Agrotis gladiaria","Swordsman Dart",Iowa,Story,2016-09-14,,"Ames, Paul",42.02064,-93.623952,"Paul Martsching",adult,"Building Light",Sighting,1,,,,,,,,,"14 Sep 2016 82/71 mostly cloudy S/SE 5-15 mph; 8 pm heavy rain"
179828,,2016-044578,,"Agrotis gladiaria","Swordsman Dart",Iowa,Story,2016-09-16,,"Ames, Paul",42.02064,-93.623952,"Paul Martsching",adult,"Building Light",Sighting,1,,,,,,,,,"16 Sep 2016 73/64 mostly cloudy W/SW ~ 8 mph.  100-245 am 17 Sep 62 deg; clear; calm > SW 3 mph; full Moon"
179829,,2016-044579,,"Agrotis gladiaria","Swordsman Dart",Iowa,Story,2016-09-17,,"Ames, Paul",42.02064,-93.623952,"Paul Martsching",adult,"Building Light",Sighting,1,,,,,,,,,"17 Sep 2016 71/60 mostly clear NW ~10 mph.  100-230 am 18 Sep 60 > 58 deg; clear, calm; nearly full Moon"
179830,,2016-044580,,"Agrotis gladiaria","Swordsman Dart",Iowa,Story,2016-09-18,,"Ames, Paul",42.02064,-93.623952,"Paul Martsching",adult,"Building Light",Sighting,1,,,,,,,,,"18 Sep 2016  83/63 mostly clear SW ~15 mph.  130-330 am 19 Sep 65 deg; clear; S 5 mph;  90 % lit Moon."
179831,,2016-044581,,"Agrotis gladiaria","Swordsman Dart",Iowa,Story,2016-09-20,,"Ames, Paul",42.02064,-93.623952,"Paul Martsching",adult,"Building Light",Sighting,3,,,,,,,,,"20 Sep 2016 87/70 mostly clear; SE ~15 mph. 100-300 am 21 Sep 76 > 72 deg; clear > mostly clear; S ~5 mph; Moon 60% lit.  (at 1 am 76/74)."
179832,,2016-044582,,"Agrotis gladiaria","Swordsman Dart",Iowa,Story,2016-09-21,,"Ames, Paul",42.02064,-93.623952,"Paul Martsching",adult,"Building Light",Sighting,6,,,,,,,,,"21 Sep 2016 91/74 hazy > partly cloudy S 20 mph.  100-330 am 22 Sep 77 > 76 deg; ; dew point 72 > 70 deg; overcast S 10-15 mph.  Alcove lights at Movies 12 still on (employees watching a new movie).  Very good night.  "
179833,,2016-044583,,"Agrotis gladiaria","Swordsman Dart",Iowa,Story,2016-09-23,,"Ames, Paul",42.02064,-93.623952,"Paul Martsching",adult,"Building Light",Sighting,2,,,,,,,,,"23 Sep 2016 ~ 85; airport weather station not functioning during day time; overcast am; partly cloudy pm.    24 Sep 100 - 400 am; constant temp 68 degrees; 40% lit Moon; partly cloudy; hazy becoming foggy; wind SE 5 - 10 mph.  Very surprised by the number of moths; some were worn, but many were very fresh; more than 40 species."
179834,,2016-044584,,"Agrotis gladiaria","Swordsman Dart",Iowa,Story,2016-10-01,,"Ames, Paul",42.02064,-93.623952,"Paul Martsching",adult,"Building Light",Sighting,1,,,,,,,,,"01 Oct 2016  69/60 overcast all day; N ~7 mph.  1245-230 am 02 Oct 60 > 58 deg; overcast > partly cloudy; N 3 mph.  Wind from the North (NW/N/NE) for 5 days.  (Parking lot lights at Movies-12 did not go off till 2:10 am !!!)  "
180167,"Paul Martsching Collection",2016-044917,,"Agrotis gladiaria","Swordsman Dart",Iowa,Story,2016-10-16,,"Ames, Paul",42.02064,-93.623952,"Paul Martsching",adult,"Building Light",Pinned,1,,,,,,,,,
198521,,2017-016455,,"Agrotis gladiaria","Swordsman Dart",Iowa,Story,2017-09-13,,"Ames, Paul",42.02064,-93.623952,"Paul Martsching",adult,"Building Light",Sighting,1,,,,,,,,,
198522,,2017-016456,,"Agrotis gladiaria","Swordsman Dart",Iowa,Story,2017-09-15,,"Ames, Paul",42.02064,-93.623952,"Paul Martsching",adult,"Building Light",Sighting,3,,,,,,,,,
198523,,2017-016457,,"Agrotis gladiaria","Swordsman Dart",Iowa,Story,2017-09-20,,"Ames, Paul",42.02064,-93.623952,"Paul Martsching",adult,"Building Light",Sighting,10,,,,,,,,,
198524,,2017-016458,,"Agrotis gladiaria","Swordsman Dart",Iowa,Story,2017-09-22,,"Ames, Paul",42.02064,-93.623952,"Paul Martsching",adult,"Building Light",Sighting,8,,,,,,,,,
198525,,2017-016459,,"Agrotis gladiaria","Swordsman Dart",Iowa,Story,2017-09-23,,"Ames, Paul",42.02064,-93.623952,"Paul Martsching",adult,"Building Light",Sighting,10,,,,,,,,,
198526,,2017-016460,,"Agrotis gladiaria","Swordsman Dart",Iowa,Story,2017-09-24,,"Ames, Paul",42.02064,-93.623952,"Paul Martsching",adult,"Building Light",Sighting,4,,,,,,,,,
198527,,2017-016461,,"Agrotis gladiaria","Swordsman Dart",Iowa,Story,2017-09-25,,"Ames, Paul",42.02064,-93.623952,"Paul Martsching",adult,"Building Light",Sighting,3,,,,,,,,,
198528,,2017-016462,,"Agrotis gladiaria","Swordsman Dart",Iowa,Story,2017-10-01,,"Ames, Paul",42.02064,-93.623952,"Paul Martsching",adult,"Building Light",Sighting,1,,,,,,,,,
207306,,2018-005471,,"Agrotis gladiaria","Swordsman Dart",Iowa,Story,2003-09-17,,"Ames, Paul",42.02064,-93.623952,"Paul Martsching",adult,"Building Light",Sighting,2,,,,,,,,,
207307,,2018-005472,,"Agrotis gladiaria","Swordsman Dart",Iowa,Story,2003-10-10,,"Ames, Paul",42.02064,-93.623952,"Paul Martsching",adult,"Building Light",Sighting,1,,,,,,,,,
207308,,2018-005473,,"Agrotis gladiaria","Swordsman Dart",Iowa,Story,2004-09-10,,"Ames, Paul",42.02064,-93.623952,"Paul Martsching",adult,"Building Light",Sighting,34,,,,,,,,,
207309,,2018-005474,,"Agrotis gladiaria","Swordsman Dart",Iowa,Story,2004-09-30,,"Ames, Paul",42.02064,-93.623952,"Paul Martsching",adult,"Building Light",Sighting,35,,,,,,,,,
207310,,2018-005475,,"Agrotis gladiaria","Swordsman Dart",Iowa,Story,2005-09-12,,"Ames, Paul",42.02064,-93.623952,"Paul Martsching",adult,"Building Light",Sighting,18,,,,,,,,,
207311,,2018-005476,,"Agrotis gladiaria","Swordsman Dart",Iowa,Story,2005-10-01,,"Ames, Paul",42.02064,-93.623952,"Paul Martsching",adult,"Building Light",Sighting,8,,,,,,,,,
207312,,2018-005477,,"Agrotis gladiaria","Swordsman Dart",Iowa,Story,2006-08-22,,"Ames, Paul",42.02064,-93.623952,"Paul Martsching",adult,"Building Light",Sighting,1,,,,,,,,,
207313,,2018-005478,,"Agrotis gladiaria","Swordsman Dart",Iowa,Story,2006-09-15,,"Ames, Paul",42.02064,-93.623952,"Paul Martsching",adult,"Building Light",Sighting,52,,,,,,,,,
207314,,2018-005479,,"Agrotis gladiaria","Swordsman Dart",Iowa,Story,2006-10-03,,"Ames, Paul",42.02064,-93.623952,"Paul Martsching",adult,"Building Light",Sighting,9,,,,,,,,,
207315,,2018-005480,,"Agrotis gladiaria","Swordsman Dart",Iowa,Story,2007-09-17,,"Ames, Paul",42.02064,-93.623952,"Paul Martsching",adult,"Building Light",Sighting,98,,,,,,,,,
207316,,2018-005481,,"Agrotis gladiaria","Swordsman Dart",Iowa,Story,2007-10-06,,"Ames, Paul",42.02064,-93.623952,"Paul Martsching",adult,"Building Light",Sighting,8,,,,,,,,,
207317,,2018-005482,,"Agrotis gladiaria","Swordsman Dart",Iowa,Story,2008-09-16,,"Ames, Paul",42.02064,-93.623952,"Paul Martsching",adult,"Building Light",Sighting,3,,,,,,,,,
207318,,2018-005483,,"Agrotis gladiaria","Swordsman Dart",Iowa,Story,2008-09-29,,"Ames, Paul",42.02064,-93.623952,"Paul Martsching",adult,"Building Light",Sighting,4,,,,,,,,,
207319,,2018-005484,,"Agrotis gladiaria","Swordsman Dart",Iowa,Story,2009-09-10,,"Ames, Paul",42.02064,-93.623952,"Paul Martsching",adult,"Building Light",Sighting,5,,,,,,,,,
207320,,2018-005485,,"Agrotis gladiaria","Swordsman Dart",Iowa,Story,2009-10-07,,"Ames, Paul",42.02064,-93.623952,"Paul Martsching",adult,"Building Light",Sighting,1,,,,,,,,,
207321,,2018-005486,,"Agrotis gladiaria","Swordsman Dart",Iowa,Story,2011-09-28,,"Ames, Paul",42.02064,-93.623952,"Paul Martsching",adult,"Building Light",Sighting,1,,,,,,,,,
207322,,2018-005487,,"Agrotis gladiaria","Swordsman Dart",Iowa,Story,2011-09-29,,"Ames, Paul",42.02064,-93.623952,"Paul Martsching",adult,"Building Light",Sighting,1,,,,,,,,,
207323,,2018-005488,,"Agrotis gladiaria","Swordsman Dart",Iowa,Story,2014-09-14,,"Ames, Paul",42.02064,-93.623952,"Paul Martsching",adult,"Building Light",Sighting,10,,,,,,,,,
207324,,2018-005489,,"Agrotis gladiaria","Swordsman Dart",Iowa,Story,2014-09-27,,"Ames, Paul",42.02064,-93.623952,"Paul Martsching",adult,"Building Light",Sighting,10,,,,,,,,,
221841,,2018-019995,,"Agrotis gladiaria","Swordsman Dart",Iowa,Winneshiek,2018-09-15,,"100 Acre Wood-x",0,0,"MJ Hatfield",adult,"Blacklight Trap",Photograph,1,,,,,,,,,
224939,,2018-020171,,"Agrotis gladiaria","Swordsman Dart",Iowa,Winneshiek,2018-09-25,,"100 Acre Wood-x",0,0,"MJ Hatfield",adult,"Blacklight Trap",Photograph,1,,,,,,,,,
224940,,2018-020173,,"Agrotis gladiaria","Swordsman Dart",Iowa,Winneshiek,2018-09-25,,"100 Acre Wood-x",0,0,"MJ Hatfield",adult,"Blacklight Trap",Photograph,1,,,,,,,,,
227413,,2019-002133,,"Agrotis gladiaria","Swordsman Dart",Iowa,Story,2018-09-12,,"Ames, Paul",42.02064,-93.623952,"Paul Martsching",adult,"Building Light",Sighting,1,,,,,,,,,
227414,,2019-002134,,"Agrotis gladiaria","Swordsman Dart",Iowa,Story,2018-09-14,,"Ames, Paul",42.02064,-93.623952,"Paul Martsching",adult,"Building Light",Sighting,4,,,,,,,,,
227415,,2019-002135,,"Agrotis gladiaria","Swordsman Dart",Iowa,Story,2018-09-15,,"Ames, Paul",42.02064,-93.623952,"Paul Martsching",adult,"Building Light",Sighting,4,,,,,,,,,
227416,,2019-002136,,"Agrotis gladiaria","Swordsman Dart",Iowa,Story,2018-09-16,,"Ames, Paul",42.02064,-93.623952,"Paul Martsching",adult,"Building Light",Sighting,3,,,,,,,,,
227417,,2019-002137,,"Agrotis gladiaria","Swordsman Dart",Iowa,Story,2018-09-17,,"Ames, Paul",42.02064,-93.623952,"Paul Martsching",adult,"Building Light",Sighting,2,,,,,,,,,
227418,,2019-002138,,"Agrotis gladiaria","Swordsman Dart",Iowa,Story,2018-09-25,,"Ames, Paul",42.02064,-93.623952,"Paul Martsching",adult,"Building Light",Sighting,1,,,,,,,,,
227419,,2019-002139,,"Agrotis gladiaria","Swordsman Dart",Iowa,Story,2018-10-03,,"Ames, Paul",42.02064,-93.623952,"Paul Martsching",adult,"Building Light",Sighting,2,,,,,,,,,
238809,,,,"Agrotis gladiaria","Swordsman Dart",Iowa,Johnson,2019-09-24,,Redacted,Redacted,Redacted,"Mark Brown",adult,"Building Light",Photograph,1,,,,,,,,,
238814,,,,"Agrotis gladiaria","Swordsman Dart",Iowa,Johnson,2019-09-24,,Redacted,Redacted,Redacted,"Mark Brown",adult,"Building Light",Photograph,1,,,,,,,,,
241496,,,,"Agrotis gladiaria","Swordsman Dart",Iowa,Johnson,2019-09-30,,"MacBride Nature Recreation Area",41.786729,-91.568057,"Mark Brown",adult,"Building Light",Photograph,1,,,,,,,,,
241525,,,,"Agrotis gladiaria","Swordsman Dart",Iowa,Johnson,2019-09-27,,"MacBride Nature Recreation Area",41.786729,-91.568057,"Mark Brown",adult,"Building Light",Photograph,1,,,,,,,,,
241539,,,,"Agrotis gladiaria","Swordsman Dart",Iowa,Johnson,2019-09-24,,"MacBride Nature Recreation Area",41.786729,-91.568057,"Mark Brown",adult,"Building Light",Photograph,1,,,,,,,,,
244602,,,,"Agrotis gladiaria","Swordsman Dart",Iowa,Story,2019-09-14,3:30,"Ames, Paul",42.02064,-93.623952,"Paul Martsching",adult,"Building Light",Sighting,1,,,,,,,,,
244603,,,,"Agrotis gladiaria","Swordsman Dart",Iowa,Story,2019-09-17,3:30,"Ames, Paul",42.02064,-93.623952,"Paul Martsching",adult,"Building Light",Sighting,1,,,,,,,,,
244604,,,,"Agrotis gladiaria","Swordsman Dart",Iowa,Story,2019-09-18,3:30,"Ames, Paul",42.02064,-93.623952,"Paul Martsching",adult,"Building Light",Sighting,3,,,,,,,,,
244605,,,,"Agrotis gladiaria","Swordsman Dart",Iowa,Story,2019-09-21,3:30,"Ames, Paul",42.02064,-93.623952,"Paul Martsching",adult,"Building Light",Sighting,1,,,,,,,,,
244606,,,,"Agrotis gladiaria","Swordsman Dart",Iowa,Story,2019-09-24,3:30,"Ames, Paul",42.02064,-93.623952,"Paul Martsching",adult,"Building Light",Sighting,5,,,,,,,,,
244607,,,,"Agrotis gladiaria","Swordsman Dart",Iowa,Story,2019-09-27,3:30,"Ames, Paul",42.02064,-93.623952,"Paul Martsching",adult,"Building Light",Sighting,1,,,,,,,,,
245965,,,,"Agrotis gladiaria","Swordsman Dart",Iowa,Story,2019-09-14,3:30,"Ames, Paul",42.02064,-93.623952,"Paul Martsching",adult,"Building Light",Sighting,1,,,,,,,,,
245966,,,,"Agrotis gladiaria","Swordsman Dart",Iowa,Story,2019-09-17,3:30,"Ames, Paul",42.02064,-93.623952,"Paul Martsching",adult,"Building Light",Sighting,1,,,,,,,,,
245967,,,,"Agrotis gladiaria","Swordsman Dart",Iowa,Story,2019-09-18,3:30,"Ames, Paul",42.02064,-93.623952,"Paul Martsching",adult,"Building Light",Sighting,3,,,,,,,,,
245968,,,,"Agrotis gladiaria","Swordsman Dart",Iowa,Story,2019-09-21,3:30,"Ames, Paul",42.02064,-93.623952,"Paul Martsching",adult,"Building Light",Sighting,1,,,,,,,,,
245969,,,,"Agrotis gladiaria","Swordsman Dart",Iowa,Story,2019-09-24,3:30,"Ames, Paul",42.02064,-93.623952,"Paul Martsching",adult,"Building Light",Sighting,5,,,,,,,,,
245970,,,,"Agrotis gladiaria","Swordsman Dart",Iowa,Story,2019-09-27,3:30,"Ames, Paul",42.02064,-93.623952,"Paul Martsching",adult,"Building Light",Sighting,1,,,,,,,,,
249339,"Frank Olsen Drawer 67",2020-000100,,"Agrotis gladiaria","Swordsman Dart",Iowa,Linn,2005-09-27,,"Palisades Kepler State Park",41.90833,-91.50238,"Frank Olsen",adult,,Pinned,1,,,,,,,,,"Located at Iowa State"
274776,,,,"Agrotis gladiaria","Swordsman Dart",Iowa,Iowa,2020-09-13,14:12:41,"Amana Lilly Pond",41.802014,-91.882467,"Mark Brown",adult,Sighting,Photograph,1,,,,,,,,,
280254,,,,"Agrotis gladiaria","Swordsman Dart",Iowa,Story,2020-09-16,,"Ames, Paul",42.011454,-93.615063,"Paul Martsching",adult,"Building Light",Sighting,2,,,,,,,,,
280255,,,,"Agrotis gladiaria","Swordsman Dart",Iowa,Story,2020-09-22,,"Ames, Paul",42.011454,-93.615063,"Paul Martsching",adult,"Building Light",Sighting,6,,,,,,,,,
280256,,,,"Agrotis gladiaria","Swordsman Dart",Iowa,Story,2020-09-23,,"Ames, Paul",42.011454,-93.615063,"Paul Martsching",adult,"Building Light",Sighting,8,,,,,,,,,
280257,,,,"Agrotis gladiaria","Swordsman Dart",Iowa,Story,2020-09-24,,"Ames, Paul",42.011454,-93.615063,"Paul Martsching",adult,"Building Light",Sighting,5,,,,,,,,,
280258,,,,"Agrotis gladiaria","Swordsman Dart",Iowa,Story,2020-09-25,,"Ames, Paul",42.011454,-93.615063,"Paul Martsching",adult,"Building Light",Sighting,5,,,,,,,,,
280259,,,,"Agrotis gladiaria","Swordsman Dart",Iowa,Story,2020-09-26,,"Ames, Paul",42.011454,-93.615063,"Paul Martsching",adult,"Building Light",Sighting,1,,,,,,,,,
298082,,,,"Agrotis gladiaria","Swordsman Dart",Iowa,Decatur,2021-10-03,14:54:32,"Slip Bluff County Park",40.65307194,-93.84647182,"Mark Brown",adult,Sighting,Photograph,1,,,,,,,,,
298746,,,,"Agrotis gladiaria","Swordsman Dart",Iowa,Story,2021-09-06,0500,"Ames, Paul",42.011732,-93.615039,"Paul Martsching",adult,Sighting,Sighting,1,60,,,0,0,,"partly cloudy",,
298775,,,,"Agrotis gladiaria","Swordsman Dart",Iowa,Story,2021-09-19,600,"Ames, Paul",42.011732,-93.615039,"Paul Martsching",adult,Sighting,Sighting,1,62,,,5,135,,"partly cloudy",,
298783,,,,"Agrotis gladiaria","Swordsman Dart",Iowa,Story,2021-09-27,0630,"Ames, Paul",42.011732,-93.615039,"Paul Martsching",adult,Sighting,Sighting,2,62,,,0,0,,clear,,
298987,,,,"Agrotis gladiaria","Swordsman Dart",Iowa,Johnson,2021-09-30,,Redacted,Redacted,Redacted,"Mark Brown",adult,"Building Light",Photograph,1,,,,,,,,,
308806,"Jim Durbin Drawer 165",2022-000079,,"Agrotis gladiaria","Swordsman Dart",Iowa,Linn,2012-09-19,,"Pleasant Creek State Recreation Area, Linn County",42.13091,-91.817056,"Frank Olsen",adult,Blacklighting,Pinned,1,,,,,,,,,
308807,"Jim Durbin Drawer 165",2022-000080,,"Agrotis gladiaria","Swordsman Dart",Iowa,Linn,2012-09-19,,"Pleasant Creek State Recreation Area, Linn County",42.13091,-91.817056,"Frank Olsen",adult,Blacklighting,Pinned,1,,,,,,,,,
321544,,,,"Agrotis gladiaria","Swordsman Dart",Iowa,Story,2022-09-20,0700,"Ames, Paul",42.011954,-93.615226,"Paul Martsching",adult,Sighting,Sighting,3,68,,66,180,5,,clear,,
332472,,,,"Agrotis gladiaria","Swordsman Dart",Iowa,Johnson,2022-09-24,07:02:48,"MacBride Nature Recreation Area",41.786914743333334,-91.56851765,"Mark Brown",adult,Sighting,Photograph,1,,,,,,,,,