ID,"Collection / Source","Catalog Number","Specify Number",Taxon,"Common Name",State,County,Date,Time,Locale,Latitude,Longitude,Collector,"Life Stage","Collection Method","Preparation Type",Count,Temperature,Humidity,"Dew Point",Wind,"Wind Direction","Barometric Pressure",Sky,"Moon Phase",Notes
6,"Frank Olsen Drawer 17",2014-000006,SPM010368,"Desmia funeralis-maculalis",None,Iowa,Linn,2007-08-21,,"Pinicon Ridge Park",42.212678,-91.534628,"Frank Olsen",adult,Sighting,Pinned,1,,,,,,,,,"Located at Iowa State"
7,"Frank Olsen Drawer 17",2014-000007,SPM010369,"Desmia funeralis-maculalis",None,Iowa,Clarke,2007-06-02,,"Red Fern Timber",40.98317,-93.75317,"Frank Olsen",adult,,Pinned,1,,,,,,,,,"Located at Iowa State"
8,"Frank Olsen Drawer 47",2014-000008,SPM010370,"Desmia funeralis-maculalis",None,Iowa,Linn,2007-08-03,,"Pinicon Ridge Park",42.21188,-91.54753,"Frank Olsen",adult,,Pinned,1,,,,,,,,,"Located at Iowa State"
9,"Frank Olsen Drawer 47",2014-000009,SPM010371,"Desmia funeralis-maculalis",None,Iowa,Delaware,2007-07-21,,"Backbone State Park",42.616,-91.5585,"Frank Olsen",adult,,Pinned,1,,,,,,,,,"Located at Iowa State"
10,,2019-006267,SPM010372,"Desmia funeralis-maculalis",None,Iowa,Louisa,2019-06-11,,"Big Sand Mound Prairie Preserve, Louisa County",41.331464,-91.082392,"Jim Durbin",adult,Blacklight/Fluorescent,Photograph,1,,,,,,,,,
1006,"Frank Olsen Drawer 17",2014-001006,SPM010368,"Desmia funeralis-maculalis",None,Iowa,Linn,2007-08-21,,"Pinicon Ridge Park",42.21188,-91.54753,"Frank Olsen",adult,,Pinned,1,,,,,,,,,"Located at Iowa State"
1007,"Frank Olsen Drawer 17",2014-001007,SPM010369,"Desmia funeralis-maculalis",None,Iowa,Clarke,2007-06-02,,"Red Fern Timber",40.98317,-93.75317,"Frank Olsen",adult,,Pinned,1,,,,,,,,,"Located at Iowa State"
1008,"Frank Olsen Drawer 17",2014-001008,SPM010370,"Desmia funeralis-maculalis",None,Iowa,Linn,2007-08-03,,"Pinicon Ridge Park",42.21188,-91.54753,"Frank Olsen",adult,,Pinned,1,,,,,,,,,"Located at Iowa State"
1009,"Frank Olsen Drawer 17",2014-001009,SPM010371,"Desmia funeralis-maculalis",None,Iowa,Delaware,2007-07-21,,"Backbone State Park",42.616,-91.5585,"Frank Olsen",adult,,Pinned,1,,,,,,,,,"Located at Iowa State"
1010,"Frank Olsen Drawer 47",2014-001010,SPM010372,"Desmia funeralis-maculalis",None,Iowa,Clarke,2007-06-02,,"Red Fern Timber",40.98317,-93.75317,"Frank Olsen",adult,,Pinned,1,,,,,,,,,"Located at Iowa State"
2761,,2014-003042,,"Desmia funeralis-maculalis",None,Iowa,Benton,2005-06-22,,"Benton County",41.9971577,-91.885094," BAMONA",adult,,Sighting,1,,,,,,,,,
10472,,2014-010754,,"Desmia funeralis-maculalis",None,Iowa,Linn,2014-08-05,,"Hitaga Sand Ridge Prairie Preserve",42.24944,-91.63056,"Jim Durbin",adult,Blacklight/Fluorescent,Photograph,1,74-68,79,67,0,,30.08,"partly cloudy",,
10777,,2014-011059,,"Desmia funeralis-maculalis",None,Iowa,Linn,2014-08-08,2030-2300DST,"Pleasant Creek State Recreation Area, Linn County",42.110327,-91.822988,"Jim Durbin",adult,Blacklight/Fluorescent,Photograph,1,72-69,79,62,Calm,,30.04,Clear,,
12093,,2014-012375,SPM041726,"Desmia funeralis-maculalis",None,Iowa,Linn,2014-06-24,,"Pleasant Creek State Recreation Area, Linn County",42.10948,-91.8249,"Jim Durbin",adult,Blacklight/Fluorescent,Photograph,1,,,,,,,,,
12114,,2014-012396,SPM041782,"Desmia funeralis-maculalis",None,Iowa,Linn,2014-06-24,,"Pleasant Creek State Recreation Area, Linn County",42.10948,-91.8249,"Jim Durbin",adult,Blacklight/Fluorescent,Photograph,1,,,,,,,,,
12131,,2014-012413,SPM042190,"Desmia funeralis-maculalis",None,Kentucky,Ohio,2014-07-02,,Redacted,Redacted,Redacted,"Jim Durbin",adult,Blacklight/Fluorescent,Photograph,1,,,,,,,,,
23155,,2014-023500,SPM008139,"Desmia funeralis-maculalis",None,Iowa,Jasper,2005-05-25,,"Neal Smith National Wildlife Refuge",41.54245,-93.2908,"Keith Summerville",adult,,Pinned,1,,,,,,,,,
23314,,2014-023660,SPM039444,"Desmia funeralis-maculalis",None,Iowa,Hardin,1950-05-01,,"Hardin County",42.42854,-93.17796," unknown",adult,,Photograph,1,,,,,,,,,"HIstorical Record"
23382,"Frank Olsen Drawer 17",2014-023728,SPM002733,"Desmia funeralis-maculalis",None,Iowa,Linn,2004-06-23,,"Pleasant Creek State Recreation Area, Linn County",42.11952,-91.81215,"Frank Olsen",adult,,Pinned,1,,,,,,,,,"Located at Iowa State"
23383,"Frank Olsen Drawer 17",2014-023729,SPM002734,"Desmia funeralis-maculalis",None,Iowa,Linn,2003-05-29,,"Wanatee County Park",42.00994,-91.57749,"Frank Olsen",adult,,Pinned,1,,,,,,,,,"Located at Iowa State"
23385,"Frank Olsen Drawer 17",2014-023731,SPM002736,"Desmia funeralis-maculalis",None,Iowa,Linn,2003-06-28,,"Wanatee County Park",42.00994,-91.57749,"Frank Olsen",adult,,Pinned,1,,,,,,,,,"Located at Iowa State"
23386,,2014-023732,SPM002737,"Desmia funeralis-maculalis",None,Iowa,Fremont,2003-06-15,,"Waubonsie State Park",40.676,-95.689,"Mark Leoschke",adult,Sighting,Pinned,1,,,,,,,,,
23387,"Frank Olsen Drawer 17",2014-023733,SPM002738,"Desmia funeralis-maculalis",None,Iowa,"Van Buren",2003-08-02,,"Shimek State Forest, Farmington Unit",40.64802,-91.7254,"Frank Olsen",adult,,Pinned,1,,,,,,,,,"Located at Iowa State"
23388,"Frank Olsen Drawer 17",2014-023734,SPM002739,"Desmia funeralis-maculalis",None,Iowa,"Van Buren",2003-08-02,,"Shimek State Forest, Farmington Unit",40.64802,-91.7254,"Frank Olsen",adult,,Pinned,1,,,,,,,,,"Located at Iowa State"
23389,"Frank Olsen Drawer 17",2014-023735,SPM002740,"Desmia funeralis-maculalis",None,Iowa,"Van Buren",2004-05-08,,"Shimek State Forest, Farmington Unit",40.64802,-91.7254,"Frank Olsen",adult,,Pinned,1,,,,,,,,,"Located at Iowa State"
23390,"Frank Olsen Drawer 17",2014-023736,SPM002741,"Desmia funeralis-maculalis",None,Iowa,"Van Buren",2004-08-22,,"Shimek State Forest, Farmington Unit",40.64802,-91.7254,"Frank Olsen",adult,,Pinned,1,,,,,,,,,"Located at Iowa State"
23391,"Frank Olsen Drawer 17",2014-023737,SPM002742,"Desmia funeralis-maculalis",None,Iowa,"Van Buren",2004-09-11,,"Shimek State Forest, Farmington Unit",40.64802,-91.7254,"Frank Olsen",adult,,Pinned,1,,,,,,,,,"Located at Iowa State"
23392,"Frank Olsen Drawer 17",2014-023738,SPM002743,"Desmia funeralis-maculalis",None,Iowa,Linn,2004-06-26,,"Wickiup Hill Outdoor Learning Area",42.08398,-91.7651,"Frank Olsen",adult,,Pinned,1,,,,,,,,,"Located at Iowa State"
23393,"Frank Olsen Drawer 17",2014-023739,SPM002744,"Desmia funeralis-maculalis",None,Iowa,Linn,2004-08-08,,"Wickiup Hill Outdoor Learning Area",42.08398,-91.7651,"Frank Olsen",adult,,Pinned,1,,,,,,,,,"Located at Iowa State"
23394,,2014-023740,SPM003512,"Desmia funeralis-maculalis",None,Iowa,Jasper,2003-05-15,,"Neal Smith National Wildlife Refuge",41.5678,-93.2675,"Keith Summerville",adult,,Pinned,1,,,,,,,,,
23405,"Frank Olsen Drawer 17",2014-023751,SPM007770,"Desmia funeralis-maculalis",None,Iowa,Appanoose,2006-07-21,,"Sharon Bluffs State Park",40.72057,-92.80018,"Frank Olsen",adult,,Pinned,1,,,,,,,,,"Located at Iowa State"
23406,"Frank Olsen Drawer 17",2014-023752,SPM007771,"Desmia funeralis-maculalis",None,Iowa,Appanoose,2006-05-20,,"Sharon Bluffs State Park",40.72057,-92.80018,"Frank Olsen",adult,,Pinned,1,,,,,,,,,"Located at Iowa State"
23407,"Frank Olsen Drawer 17",2014-023753,SPM007772,"Desmia funeralis-maculalis",None,Iowa,"Van Buren",2006-06-15,,"Shimek State Forest, Farmington Unit",40.64802,-91.7254,"Frank Olsen",adult,,Pinned,1,,,,,,,,,"Located at Iowa State"
23408,"Frank Olsen Drawer 17",2014-023754,SPM007773,"Desmia funeralis-maculalis",None,Iowa,Muscatine,2006-08-08,,"Wildcat Den State Park",41.4705,-90.88228,"Frank Olsen",adult,,Pinned,1,,,,,,,,,"Located at Iowa State"
23409,"Frank Olsen Drawer 17",2014-023755,SPM007774,"Desmia funeralis-maculalis",None,Iowa,Floyd,2006-08-22,,"Rockford Fossil & Prairie Park Preserve",43.04778,-92.97113,"Frank Olsen",adult,,Pinned,1,,,,,,,,,"Located at Iowa State"
23410,"Frank Olsen Drawer 17",2014-023756,SPM007775,"Desmia funeralis-maculalis",None,Iowa,Floyd,2006-07-27,,"Rockford Fossil & Prairie Park Preserve",43.04778,-92.97113,"Frank Olsen",adult,,Pinned,1,,,,,,,,,"Located at Iowa State"
23422,"Frank Olsen Drawer 17",2014-023768,SPM013050,"Desmia funeralis-maculalis",None,Iowa,"Van Buren",2008-06-07,,"Shimek State Forest, Farmington Unit",40.64802,-91.7254,"Frank Olsen",adult,,Pinned,1,,,,,,,,,"Located at Iowa State"
23423,"Frank Olsen Drawer 17",2014-023769,SPM013051,"Desmia funeralis-maculalis",None,Iowa,Muscatine,2008-08-31,,"Wildcat Den State Park",41.4705,-90.88228,"Frank Olsen",adult,,Pinned,1,,,,,,,,,"Located at Iowa State"
23424,"Frank Olsen Drawer 17",2014-023770,SPM013052,"Desmia funeralis-maculalis",None,Iowa,Clarke,2008-08-14,,"Red Fern Timber",40.98317,-93.75317,"Frank Olsen",adult,,Pinned,1,,,,,,,,,"Located at Iowa State"
23425,"Frank Olsen Drawer 17",2014-023771,SPM013053,"Desmia funeralis-maculalis",None,Iowa,Cass,2008-08-23,,"Frank Chapman Pellet Memorial Woods",41.431545,-94.982644,"Frank Olsen",adult,,Pinned,1,,,,,,,,,"Located at Iowa State"
23426,"Frank Olsen Drawer 17",2014-023772,SPM013054,"Desmia funeralis-maculalis",None,Iowa,Linn,2008-09-26,,"Hanging Bog State Preserve",42.0333365,-91.767999,"Frank Olsen",adult,,Pinned,1,,,,,,,,,"Located at Iowa State"
23429,"Frank Olsen Drawer 17",2014-023775,SPM016070,"Desmia funeralis-maculalis",None,Iowa,Fremont,2009-09-06,,"Waubonsie State Park",40.676,-95.689,"Frank Olsen",adult,,Pinned,1,,,,,,,,,"Located at Iowa State"
23430,"Frank Olsen Drawer 17",2014-023776,SPM016395,"Desmia funeralis-maculalis",None,Iowa,Linn,2009-08-15,,"Pleasant Creek State Recreation Area, Linn County",42.11952,-91.81215,"Frank Olsen",adult,,Pinned,1,,,,,,,,,"Located at Iowa State"
23432,,2014-023778,SPM016744,"Desmia funeralis-maculalis",None,Iowa,Dallas,2008-08-16,,"Adel - Prairie Seed Production Plots",41.658682,-94.030508,"Toni Dudley",adult,,Photograph,1,,,,,,,,,
23433,,2014-023779,SPM016944,"Desmia funeralis-maculalis",None,Iowa,Winneshiek,2007-06-14,,"Plymouth Rock-x",0,0,"MJ Hatfield",adult,,Pinned,1,,,,,,,,,
23434,,2014-023780,SPM017033,"Desmia funeralis-maculalis",None,Iowa,Winneshiek,2009-07-23,,"Hickory Ridge Woods",43.31803,-91.79667,"Reese Worthington",adult,,Pinned,1,,,,,,,,,
23436,,2014-023782,SPM017709,"Desmia funeralis-maculalis",None,Iowa,Polk,2010-05-27,,"Chichaqua Bottoms Greenbelt",41.7958,-93.413,"Aaron Brees",adult,,Photograph,1,,,,,,,,,
23438,,2014-023784,SPM019801,"Desmia funeralis-maculalis",None,Iowa,Johnson,2010-07-11,,"Iowa City Site 1",41.62806,-91.51417,"Mark Brown",adult,,Photograph,1,,,,,,,,,
23439,"Frank Olsen Drawer 17",2014-023785,SPM020320,"Desmia funeralis-maculalis",None,Iowa,Clarke,2010-07-25,,"Red Fern Timber",40.98317,-93.75317,"Frank Olsen",adult,,Pinned,1,,,,,,,,,"Located at Iowa State"
23440,"Frank Olsen Drawer 17",2014-023786,SPM020321,"Desmia funeralis-maculalis",None,Iowa,"Black Hawk",2010-07-21,,"Cedar Hills Sand Prairie Preserve",42.59305,-92.55315,"Frank Olsen",adult,,Pinned,1,,,,,,,,,"Located at Iowa State"
23441,"Frank Olsen Drawer 17",2014-023787,SPM020457,"Desmia funeralis-maculalis",None,Iowa,Linn,2010-08-06,,"Wickiup Hill Outdoor Learning Area",42.08398,-91.7651,"Frank Olsen",adult,,Pinned,1,,,,,,,,,"Located at Iowa State"
23442,"Frank Olsen Drawer 17",2014-023788,SPM020458,"Desmia funeralis-maculalis",None,Iowa,Clayton,2010-08-04,,"Osborne Outdoor Education Center Park",42.79303,-91.4432,"Frank Olsen",adult,,Pinned,1,,,,,,,,,"Located at Iowa State"
23443,,2014-023789,SPM021520,"Desmia funeralis-maculalis",None,Iowa,Jefferson,2010-05-30,,"Near Fairfield",41.0503,-92.024,"Moni Hayne",adult,Blacklight/Fluorescent,Photograph,1,,,,,,,,,
23444,,2014-023790,SPM021521,"Desmia funeralis-maculalis",None,Iowa,Jefferson,2010-07-17,,"Near Fairfield",41.0503,-92.024,"Moni Hayne",adult,Blacklight/Fluorescent,Photograph,1,,,,,,,,,
23445,,2014-023791,SPM021666,"Desmia funeralis-maculalis",None,Iowa,"Van Buren",2011-06-05,,"Shimek State Forest, Farmington Unit",40.6659,-91.73637,"Jim Durbin",adult,Blacklight/Fluorescent,Photograph,1,,,,,,,,,
23446,,2014-023792,SPM021667,"Desmia funeralis-maculalis",None,Iowa,"Van Buren",2011-06-05,,"Shimek State Forest, Farmington Unit",40.6659,-91.73637,"Jim Durbin",adult,Blacklight/Fluorescent,Photograph,1,,,,,,,,,
23447,,2014-023793,SPM023946,"Desmia funeralis-maculalis",None,Iowa,"Van Buren",2006-09-16,,"Indian Lake Park, Farmington",40.63518,-91.75017,"Jim Durbin",adult,Blacklight/Fluorescent,Photograph,1,,,,,,,,,
23448,,2014-023794,SPM024781,"Desmia funeralis-maculalis",None,Iowa,Winneshiek,2010-08-07,,"Plymouth Rock-x",0,0,"MJ Hatfield",adult,,Photograph,1,,,,,,,,,
23449,"Frank Olsen Drawer 17",2014-023795,SPM024872,"Desmia funeralis-maculalis",None,Iowa,"Black Hawk",2011-07-30,,"Cedar Hills Sand Prairie Preserve",42.59305,-92.55315,"Frank Olsen",adult,,Pinned,1,,,,,,,,,"Located at Iowa State"
23450,"Frank Olsen Drawer 17",2014-023796,SPM024873,"Desmia funeralis-maculalis",None,Iowa,"Black Hawk",2011-07-30,,"Cedar Hills Sand Prairie Preserve",42.59305,-92.55315,"Frank Olsen",adult,,Pinned,1,,,,,,,,,"Located at Iowa State"
23451,"Frank Olsen Drawer 17",2014-023797,SPM024874,"Desmia funeralis-maculalis",None,Iowa,"Black Hawk",2011-07-30,,"Cedar Hills Sand Prairie Preserve",42.59305,-92.55315,"Frank Olsen",adult,,Pinned,1,,,,,,,,,"Located at Iowa State"
23452,"Frank Olsen Drawer 17",2014-023798,SPM024875,"Desmia funeralis-maculalis",None,Iowa,"Van Buren",2011-07-20,,"Shimek State Forest, Farmington Unit",40.6659,-91.73637,"Frank Olsen",adult,,Pinned,1,,,,,,,,,"Located at Iowa State"
23453,"Frank Olsen Drawer 17",2014-023799,SPM024876,"Desmia funeralis-maculalis",None,Iowa,"Van Buren",2011-06-03,,"Shimek State Forest, Farmington Unit",40.6659,-91.73637,"Frank Olsen",adult,,Pinned,1,,,,,,,,,"Located at Iowa State"
23454,"Frank Olsen Drawer 17",2014-023800,SPM024877,"Desmia funeralis-maculalis",None,Iowa,"Van Buren",2011-06-03,,"Shimek State Forest, Farmington Unit",40.6659,-91.73637,"Frank Olsen",adult,,Pinned,1,,,,,,,,,"Located at Iowa State"
23455,"Frank Olsen Drawer 17",2014-023801,SPM024878,"Desmia funeralis-maculalis",None,Iowa,Linn,2011-08-15,,"Matsell Bridge Natural Area",42.13131,-91.38886,"Frank Olsen",adult,,Pinned,1,,,,,,,,,"Located at Iowa State"
23456,"Frank Olsen Drawer 17",2014-023802,SPM024879,"Desmia funeralis-maculalis",None,Iowa,Tama,2011-08-11,,"Hickory Hills Park, Tama County",42.2593,-92.3093,"Frank Olsen",adult,,Pinned,1,,,,,,,,,"Located at Iowa State"
23457,"Frank Olsen Drawer 17",2014-023803,SPM024880,"Desmia funeralis-maculalis",None,Iowa,Warren,2011-07-24,,"Woodland Mounds State Preserve",41.34618,-93.4281,"Frank Olsen",adult,,Pinned,1,,,,,,,,,"Located at Iowa State"
23458,"Frank Olsen Drawer 17",2014-023804,SPM024881,"Desmia funeralis-maculalis",None,Iowa,Linn,2011-06-27,,"Wickiup Hill Outdoor Learning Area",42.08398,-91.7651,"Frank Olsen",adult,,Pinned,1,,,,,,,,,"Located at Iowa State"
23459,"Frank Olsen Drawer 17",2014-023805,SPM025023,"Desmia funeralis-maculalis",None,Iowa,Linn,2011-06-27,,"Wickiup Hill Outdoor Learning Area",42.08398,-91.7651,"Frank Olsen",adult,,Pinned,1,,,,,,,,,"Located at Iowa State"
23460,,2014-023806,SPM025272,"Desmia funeralis-maculalis",None,Iowa,Polk,2011-05-18,,"Puccoon Prairie",41.73528,-93.36417,"Keith Summerville",adult,,Sighting,1,,,,,,,,,
23461,,2014-023807,SPM025776,"Desmia funeralis-maculalis",None,Iowa,Polk,2011-05-18,,"Chichaqua Bottoms Sandhill Prairie",41.77278,-93.385,"Keith Summerville",adult,,Sighting,1,,,,,,,,,
23462,,2014-023808,SPM025918,"Desmia funeralis-maculalis",None,Iowa,Polk,2011-05-18,,Redacted,Redacted,Redacted,"Keith Summerville",adult,,Sighting,1,,,,,,,,,
23463,,2014-023809,SPM026027,"Desmia funeralis-maculalis",None,Iowa,Polk,2011-05-18,,"Chichaqua Bottoms Sandhill Prairie",41.77167,-93.38361,"Keith Summerville",adult,,Sighting,1,,,,,,,,,
23464,,2014-023810,SPM026623,"Desmia funeralis-maculalis",None,Iowa,Linn,2012-05-04,,"Wakpicada Natural Area",42.18892,-91.52035,"Jim Durbin",adult,Blacklight/Fluorescent,Photograph,1,,,,,,,,,
23465,,2014-023811,SPM026795,"Desmia funeralis-maculalis",None,Iowa,Linn,2012-05-06,,"Matsell Bridge Natural Area",42.13131,-91.38886,"Jim Durbin",adult,Blacklight/Fluorescent,Photograph,1,,,,,,,,,
23466,,2014-023812,SPM030025,"Desmia funeralis-maculalis",None,Iowa,Kossuth,2012-06-14,,Algona,43.06998,-94.23295,"Matt Kenne",adult,,Sighting,1,,,,,,,,,
23467,,2014-023813,SPM030744,"Desmia funeralis-maculalis",None,Iowa,Linn,2012-07-19,,"Wanatee County Park",42.01026,-91.57381,"Jim Durbin",adult,Blacklight/Fluorescent,Photograph,1,,,,,,,,,
23468,"Frank Olsen Drawer 17",2014-023814,SPM031723,"Desmia funeralis-maculalis",None,Iowa,Clarke,2012-05-27,,"Red Fern Timber",40.98317,-93.75317,"Frank Olsen",adult,,Pinned,1,,,,,,,,,"Located at Iowa State"
23469,"Frank Olsen Drawer 17",2014-023815,SPM031724,"Desmia funeralis-maculalis",None,Iowa,Clarke,2012-05-27,,"Red Fern Timber",40.98317,-93.75317,"Frank Olsen",adult,,Pinned,1,,,,,,,,,"Located at Iowa State"
23470,"Frank Olsen Drawer 17",2014-023816,SPM031725,"Desmia funeralis-maculalis",None,Iowa,"Van Buren",2012-06-10,,"Shimek State Forest, Farmington Unit",40.6659,-91.73637,"Frank Olsen",adult,,Pinned,1,,,,,,,,,"Located at Iowa State"
23471,"Frank Olsen Drawer 17",2014-023817,SPM032278,"Desmia funeralis-maculalis",None,Iowa,Dubuque,2012-07-10,,"Mines of Spain State Recreational Area",42.4453,-90.62293,"Frank Olsen",adult,,Pinned,1,,,,,,,,,"Located at Iowa State"
23472,"Frank Olsen Drawer 17",2014-023818,SPM032279,"Desmia funeralis-maculalis",None,Iowa,Linn,2012-08-03,,"Wickiup Hill Outdoor Learning Area",42.08398,-91.7651,"Frank Olsen",adult,,Pinned,1,,,,,,,,,"Located at Iowa State"
23473,"Frank Olsen Drawer 17",2014-023819,SPM032280,"Desmia funeralis-maculalis",None,Iowa,Benton,2012-06-24,,"Minne Estema Park",42.257,-92.0198,"Frank Olsen",adult,,Pinned,1,,,,,,,,,"Located at Iowa State"
23474,"Frank Olsen Drawer 17",2014-023820,SPM032524,"Desmia funeralis-maculalis",None,Iowa,Dubuque,2012-08-15,,"Catfish Creek State Preserve",42.4679,-90.6553,"Frank Olsen",adult,,Pinned,1,,,,,,,,,"Located at Iowa State"
23475,"Frank Olsen Drawer 17",2014-023821,SPM032525,"Desmia funeralis-maculalis",None,Iowa,Benton,2012-08-22,,"Minne Estema Park",42.257,-92.0198,"Frank Olsen",adult,,Pinned,1,,,,,,,,,"Located at Iowa State"
23476,,2014-023822,SPM032919,"Desmia funeralis-maculalis",None,Iowa,Benton,2005-06-22,,"Benton County",41.99715,-91.88509,"Adel Zeller",adult,,Photograph,1,,,,,,,,,
23478,,2014-023824,SPM034313,"Desmia funeralis-maculalis",None,Kentucky,Ohio,2013-07-02,,Redacted,Redacted,Redacted,"Jim Durbin",adult,Blacklight/Fluorescent,Photograph,1,,,,,,,,,
23479,"Frank Olsen Drawer 17",2014-023825,SPM036507,"Desmia funeralis-maculalis",None,Iowa,Dubuque,2013-06-19,,"Catfish Creek State Preserve",42.4679,-90.6553,"Frank Olsen",adult,,Pinned,1,,,,,,,,,"Located at Iowa State"
23480,,2014-023826,SPM036955,"Desmia funeralis-maculalis",None,Iowa,Marshall,2007-06-07,,Redacted,Redacted,Redacted,"Carl Kurtz",adult,,Photograph,1,,,,,,,,,
23481,"Frank Olsen Drawer 17",2014-023827,SPM037211,"Desmia funeralis-maculalis",None,Iowa,Clarke,2013-08-03,,"Red Fern Timber",40.98317,-93.75317,"Frank Olsen",adult,,Pinned,1,,,,,,,,,"Located at Iowa State"
23482,"Frank Olsen Drawer 17",2014-023828,SPM037212,"Desmia funeralis-maculalis",None,Iowa,Fremont,2013-09-02,,"Waubonsie State Park",40.676,-95.689,"Frank Olsen",adult,,Pinned,1,,,,,,,,,"Located at Iowa State"
23483,,2014-023829,SPM037580,"Desmia funeralis-maculalis",None,Iowa,Jefferson,2012-07-25,,"Jefferson County Park",40.98639,-91.99111,"Moni Hayne",adult,Blacklight/Fluorescent,Photograph,1,,,,,,,,,
23484,,2014-023830,SPM038966,"Desmia funeralis-maculalis",None,Iowa,Dallas,2008-08-16,,"Adel - Prairie Seed Production Plots",41.658682,-94.030508,"Toni Dudley",adult,,Photograph,1,,,,,,,,,
23485,,2014-023831,SPM040028,"Desmia funeralis-maculalis",None,Iowa,Linn,2014-06-02,,"Pinicon Ridge Park",42.21028,-91.54417,"Jim Durbin",adult,Blacklight/Fluorescent,Photograph,1,,,,,,,,,
23486,,2014-023832,SPM040033,"Desmia funeralis-maculalis",None,Iowa,Linn,2014-06-02,,"Pinicon Ridge Park",42.21028,-91.54417,"Jim Durbin",adult,Blacklight/Fluorescent,Photograph,1,,,,,,,,,
23487,,2014-023833,SPM000207,"Desmia funeralis-maculalis",None,Iowa,Linn,2003-07-14,,"Wanatee County Park",42.0094,-91.56623,"Jim Durbin",adult,Blacklight/Fluorescent,Sighting,1,,,,,,,,,
23488,,2014-023834,SPM000383,"Desmia funeralis-maculalis",None,Iowa,Linn,2003-07-14,,"Wanatee County Park",42.0094,-91.56623,"Jim Durbin",adult,Blacklight/Fluorescent,Sighting,1,,,,,,,,,
23490,"Frank Olsen Drawer 47",2014-023836,SPM002745,"Desmia funeralis-maculalis",None,Iowa,Linn,2003-08-16,,"Wanatee County Park",42.00994,-91.57749,"Frank Olsen",adult,,Pinned,1,,,,,,,,,"Located at Iowa State"
23495,"Frank Olsen Drawer 47",2014-023841,SPM013055,"Desmia funeralis-maculalis",None,Iowa,Clarke,2008-08-14,,"Red Fern Timber",40.98317,-93.75317,"Frank Olsen",adult,,Pinned,1,,,,,,,,,"Located at Iowa State"
23497,,2014-023843,SPM017074,"Desmia funeralis-maculalis",None,Iowa,Winneshiek,2005-07-30,,"Rpck Spring Farm",43.47982,-91.67273,"D Schultz",adult,,Pinned,1,,,,,,,,,
23498,"Frank Olsen Drawer 47",2014-023844,SPM020322,"Desmia funeralis-maculalis",None,Iowa,Clarke,2010-07-25,,"Red Fern Timber",40.98317,-93.75317,"Frank Olsen",adult,,Pinned,1,,,,,,,,,"Located at Iowa State"
23499,"Frank Olsen Drawer 47",2014-023845,SPM020459,"Desmia funeralis-maculalis",None,Iowa,"Van Buren",2010-09-20,,"Shimek State Forest, Farmington Unit",40.64802,-91.7254,"Frank Olsen",adult,,Pinned,1,,,,,,,,,"Located at Iowa State"
23503,,2014-023849,SPM022172,"Desmia funeralis-maculalis",None,Iowa,Linn,2011-06-14,,"Wickiup Hill Outdoor Learning Area",42.08398,-91.7651,"Jim Durbin",adult,Blacklight/Fluorescent,Photograph,1,,,,,,,,,
23504,,2014-023850,SPM022327,"Desmia funeralis-maculalis",None,Iowa,Linn,2011-06-20,,"Wickiup Hill Outdoor Learning Area",42.08398,-91.7651,"Jim Durbin",adult,Blacklight/Fluorescent,Photograph,1,,,,,,,,,
23505,,2014-023851,SPM022328,"Desmia funeralis-maculalis",None,Iowa,Linn,2011-06-20,,"Wickiup Hill Outdoor Learning Area",42.08398,-91.7651,"Jim Durbin",adult,Blacklight/Fluorescent,Photograph,1,,,,,,,,,
23507,,2014-023853,SPM023354,"Desmia funeralis-maculalis",None,Kentucky,Ohio,2011-08-10,,"Leon's Farm, Ohio County",37.42033,-86.77023,"Jim Durbin",adult,Blacklight/Fluorescent,Photograph,1,,,,,,,,,
23508,,2014-023854,SPM023516,"Desmia funeralis-maculalis",None,Iowa,Linn,2011-08-19,,"Wanatee County Park",42.0094,-91.56623,"Jim Durbin",adult,Blacklight/Fluorescent,Photograph,1,,,,,,,,,
23509,,2014-023855,SPM023532,"Desmia funeralis-maculalis",None,Iowa,Linn,2011-08-19,,"Wanatee County Park",42.0094,-91.56623,"Jim Durbin",adult,Blacklight/Fluorescent,Photograph,1,,,,,,,,,
23510,,2014-023856,SPM023716,"Desmia funeralis-maculalis",None,Iowa,Winneshiek,2011-08-26,,"100 Acre Wood-x",43.431848,-92.009353,"Jim Durbin",adult,Blacklight/Fluorescent,Photograph,1,,,,,,,,,
23511,,2014-023857,SPM024064,"Desmia funeralis-maculalis",None,Iowa,Winneshiek,2010-08-07,,"Plymouth Rock-x",0,0,"MJ Hatfield",adult,,Photograph,1,,,,,,,,,
23512,,2014-023858,SPM024065,"Desmia funeralis-maculalis",None,Iowa,Story,2011-07-30,,"McFarland Park",42.092878,-93.571,"Loren & Babs Padelford",adult,,Photograph,1,,,,,,,,,
23513,"Frank Olsen Drawer 47",2014-023859,SPM024882,"Desmia funeralis-maculalis",None,Iowa,"Van Buren",2011-07-20,,"Shimek State Forest, Farmington Unit",40.6659,-91.73637,"Frank Olsen",adult,,Pinned,1,,,,,,,,,"Located at Iowa State"
23514,"Frank Olsen Drawer 47",2014-023860,SPM025024,"Desmia funeralis-maculalis",None,Iowa,"Black Hawk",2011-08-19,,"Cedar Hills Sand Prairie Preserve",42.59305,-92.55315,"Frank Olsen",adult,,Pinned,1,,,,,,,,,"Located at Iowa State"
23515,,2014-023861,SPM031124,"Desmia funeralis-maculalis",None,Iowa,Linn,2012-07-29,,"Matsell Bridge Natural Area",42.13131,-91.38886,"Jim Durbin",adult,Blacklight/Fluorescent,Photograph,1,,,,,,,,,