ID,"Collection / Source","Catalog Number","Specify Number",Taxon,"Common Name",State,County,Date,Time,Locale,Latitude,Longitude,Collector,"Life Stage","Collection Method","Preparation Type",Count,Temperature,Humidity,"Dew Point",Wind,"Wind Direction","Barometric Pressure",Sky,"Moon Phase",Notes
181991,,2016-046739,,"Syrbula admirabilis","Admirable Grasshopper",Iowa,Mills,2016-08-13,,"Folsom Point Preserve",41.16139,-95.795,"Mark Brown",adult,,Photograph,1,,,,,,,,,
182016,,2016-046764,,"Syrbula admirabilis","Admirable Grasshopper",Iowa,Harrison,2016-08-14,,"Desoto National Wildlife Refuge",41.541092,-96.030807,"Mark Brown",adult,,Photograph,1,,,,,,,,,
271720,,,,"Syrbula admirabilis","Admirable Grasshopper",Iowa,Wapello,2020-08-04,14:49:48,"Eddyville Sand Prairie Park",41.1543329,-92.61797536,"Mark Brown",adult,Sighting,Photograph,1,,,,,,,,,
274760,,,,"Syrbula admirabilis","Admirable Grasshopper",Iowa,Wapello,2020-09-20,14:36:26,"Eddyville Sand Prairie Park",41.15365029,-92.61814166,"Mark Brown",adult,Sighting,Photograph,1,,,,,,,,,
282222,,,,"Syrbula admirabilis","Admirable Grasshopper",Iowa,Wapello,2020-08-04,,"Eddyville Sand Prairie Park",41.155613,-92.617153,"Mark Brown",adult,Sighting,Photograph,1,,,,,,,,,
320129,,,,"Syrbula admirabilis","Admirable Grasshopper",Iowa,Wapello,2022-07-10,,"Eddyville Sand Prairie Park",41.15375,-92.618925,"Mark Brown",adult,Sighting,Photograph,1,,,,,,,,,
332490,,,,"Syrbula admirabilis","Admirable Grasshopper",Iowa,Mahaska,2022-09-24,13:49:39,"Eddyville Cemetery Wetland",41.16761936,-92.63245164166666,"Mark Brown",adult,Sighting,Photograph,1,,,,,,,,,
332502,,,,"Syrbula admirabilis","Admirable Grasshopper",Iowa,Mahaska,2022-09-24,14:44:10,"Eddyville Cemetery Wetland",41.16761936,-92.63245164166666,"Mark Brown",adult,Sighting,Photograph,1,,,,,,,,,
332950,,,,"Syrbula admirabilis","Admirable Grasshopper",Iowa,Johnson,2022-09-11,14:59:12,"Terry Trueblood Recreation Area",41.627257135,-91.53149758166667,"Mark Brown",adult,Sighting,Photograph,1,,,,,,,,,
344789,,,,"Syrbula admirabilis","Admirable Grasshopper",Iowa,Mills,2023-08-05,,"Folsom Point Preserve",41.154432,-95.799393,"Jay Gilliam",adult,Sighting,Photograph,1,,,,,,,,,
344890,,,,"Syrbula admirabilis","Admirable Grasshopper",Iowa,Mills,2023-08-27,,"Folsom Point Preserve",41.154432,-95.799393,"Jay Gilliam",adult,Sighting,Photograph,1,,,,,,,,,
344891,,,,"Syrbula admirabilis","Admirable Grasshopper",Iowa,Mills,2023-08-27,,"Folsom Point Preserve",41.154432,-95.799393,"Jay Gilliam",adult,Sighting,Photograph,1,,,,,,,,,
345010,,,,"Syrbula admirabilis","Admirable Grasshopper",Iowa,Wapello,2023-10-08,,"Deer Creek Wildlife Management Area",42.718031,-96.511437,"Jay Gilliam",adult,Sighting,Photograph,1,,,,,,,,,
349545,,,,"Syrbula admirabilis","Admirable Grasshopper",Iowa,Johnson,2023-08-12,,"Iowa City",41.666255,-91.546738,ataraxia,adult,Sighting,Photograph,1,,,,,,,,,
