ID,"Collection / Source","Catalog Number","Specify Number",Taxon,"Common Name",State,County,Date,Time,Locale,Latitude,Longitude,Collector,"Life Stage","Collection Method","Preparation Type",Count,Temperature,Humidity,"Dew Point",Wind,"Wind Direction","Barometric Pressure",Sky,"Moon Phase",Notes
144680,,2016-009302,,"Melissodes bimaculata","Two-spotted Longhorn Bee",Iowa,Johnson,2014-08-23,,"Hawkeye Willdlife Management Area",41.77465,-91.71518,"Mark Brown",adult,,Photograph,1,,,,,,,,,
144753,,2016-009375,,"Melissodes bimaculata","Two-spotted Longhorn Bee",Iowa,Johnson,2012-06-28,,"Iowa City Site 1",41.62806,-91.51417,"Mark Brown",adult,,Photograph,1,,,,,,,,,
181827,,2016-046556,,"Melissodes bimaculata","Two-spotted Longhorn Bee",Iowa,Johnson,2016-07-26,,Redacted,Redacted,Redacted,"Mark Brown",adult,,Photograph,1,,,,,,,,,
235045,,,,"Melissodes bimaculata","Two-spotted Longhorn Bee",Iowa,Linn,2019-07-23,10:47:32,"1460 Douglas Ct, Marion",42.040069,-91.590953,"Jim Durbin",adult,Sighting,Photograph,1,,,,,,,,,
247345,,,,"Melissodes bimaculata","Two-spotted Longhorn Bee",Iowa,Polk,2019-07-28,6:08:42,Redacted,Redacted,Redacted,"Mark Brown",adult,"Building Light",Photograph,1,,,,,,,,,
268962,,,,"Melissodes bimaculata","Two-spotted Longhorn Bee",Iowa,"Black Hawk",2020-07-21,19:44:08,Waterloo,42.481192,-92.34153,"Theresa Britt",,,Photograph,1,,,,,,,,,"Finally, your site was able to identify this interesting little critter former. I don't believe I ever seen them before this year (waterloo, Iowa). Evidently they love zebra grass, a friend of mine has a lot of them on her zebra grass as well (ankeny, Iowa). Thanks!!"
279352,,,,"Melissodes bimaculata","Two-spotted Longhorn Bee",Iowa,Johnson,2020-07-20,,Redacted,Redacted,Redacted,"Mark Brown",adult,Sighting,Photograph,1,,,,,,,,,
290355,,,,"Melissodes bimaculata","Two-spotted Longhorn Bee",Iowa,Linn,2021-07-16,19:00:11,"Martin Sports Complex",42.140121,-91.619592,"Hayley  Parke",adult,Sighting,Photograph,1,,,,,,,,,
290863,,,,"Melissodes bimaculata","Two-spotted Longhorn Bee",Iowa,Linn,2021-07-14,14:51:26,"1460 Douglas Ct, Marion",42.040069,-91.590953,"Jim Durbin",adult,Sighting,Photograph,1,,,,,,,,,
295155,,,,"Melissodes bimaculata","Two-spotted Longhorn Bee",Iowa,Linn,2021-08-08,13:11:34,"1460 Douglas Ct, Marion",42.040069,-91.590953,"Jim Durbin",adult,Sighting,Photograph,1,,,,,,,,,
298242,,,,"Melissodes bimaculata","Two-spotted Longhorn Bee",Iowa,Johnson,2021-08-08,,"Reif Reilly Fen and Prairie",41.830951,-91.48912,"Mark Brown",adult,Sighting,Photograph,1,,,,,,,,,
301273,,,,"Melissodes bimaculata","Two-spotted Longhorn Bee",Iowa,Warren,2021-08-04,,Redacted,Redacted,Redacted,"Jay Gilliam",adult,Sighting,Photograph,1,,,,,,,,,"Gilliam yard
"
301279,,,,"Melissodes bimaculata","Two-spotted Longhorn Bee",Iowa,Warren,2021-08-05,,Redacted,Redacted,Redacted,"Jay Gilliam",adult,Sighting,Photograph,1,,,,,,,,,"Gilliam yard"
311697,,,,"Melissodes bimaculata","Two-spotted Longhorn Bee",Iowa,Linn,2022-07-07,12:43:41,"1460 Douglas Ct, Marion",42.040069,-91.590953,"Jim Durbin",adult,Sighting,Photograph,1,,,,,,,,,
312906,,,,"Melissodes bimaculata","Two-spotted Longhorn Bee",Iowa,Linn,2022-07-28,13:38:29,"Wanatee County Park",42.01289408,-91.56941857,"Jim Durbin",adult,Sighting,Photograph,1,,,,,,,,,
316249,,,,"Melissodes bimaculata","Two-spotted Longhorn Bee",Iowa,Johnson,2020-08-10,,"Willow Creek/Kiwanis Park",41.647924,-91.569677,"Peter Hansen",adult,Sighting,Photograph,1,,,,,,,,,
316250,,,,"Melissodes bimaculata","Two-spotted Longhorn Bee",Iowa,Johnson,2022-08-03,,"Willow Creek/Kiwanis Park",41.647924,-91.569677,"Peter Hansen",adult,Sighting,Photograph,1,,,,,,,,,
319714,,,,"Melissodes bimaculata","Two-spotted Longhorn Bee",Iowa,Warren,2022-08-09,,Redacted,Redacted,Redacted,"Jay Gilliam",adult,Sighting,Photograph,1,,,,,,,,,
319840,,,,"Melissodes bimaculata","Two-spotted Longhorn Bee",Iowa,Decatur,2022-07-03,,"Slip Bluff County Park",40.652884,-93.847544,"Jay Gilliam",adult,Sighting,Photograph,1,,,,,,,,,
319990,,,,"Melissodes bimaculata","Two-spotted Longhorn Bee",Iowa,Warren,2022-07-29,,Redacted,Redacted,Redacted,"Jay Gilliam",adult,Sighting,Photograph,1,,,,,,,,,
320012,,,,"Melissodes bimaculata","Two-spotted Longhorn Bee",Iowa,Warren,2022-08-01,,Redacted,Redacted,Redacted,"Jay Gilliam",adult,Sighting,Photograph,1,,,,,,,,,
335603,,,,"Melissodes bimaculata","Two-spotted Longhorn Bee",Iowa,Linn,2023-06-16,12:16:57,"1460 Douglas Ct, Marion",42.040094923333,-91.591176915,"Jim Durbin",adult,Sighting,Photograph,1,,,,,,,,,
336919,,,,"Melissodes bimaculata","Two-spotted Longhorn Bee",Iowa,Benton,2023-07-06,11:44:27,"Wildcat Bluff Recreational Area",42.19331874,-91.88041838,"Jim Durbin",adult,Sighting,Photograph,1,,,,,,,,,
336923,,,,"Melissodes bimaculata","Two-spotted Longhorn Bee",Iowa,Benton,2023-07-06,11:51:17,"Wildcat Bluff Recreational Area",42.19331874,-91.88041838,"Jim Durbin",adult,Sighting,Photograph,1,,,,,,,,,
337336,,,,"Melissodes bimaculata","Two-spotted Longhorn Bee",Iowa,Linn,2023-07-05,13:17:41,"1460 Douglas Ct, Marion",42.04008425,-91.59092591,"Jim Durbin",adult,Sighting,Photograph,1,,,,,,,,,
337602,,,,"Melissodes bimaculata","Two-spotted Longhorn Bee",Iowa,Linn,2023-07-16,16:28:09,Redacted,Redacted,Redacted,"james durbin II",adult,Sighting,Photograph,1,,,,,,,,,
338749,,,,"Melissodes bimaculata","Two-spotted Longhorn Bee",Iowa,Linn,2023-07-22,12:41:58,Redacted,Redacted,Redacted,"Jim Durbin",adult,Sighting,Photograph,1,,,,,,,,,
340558,,,,"Melissodes bimaculata","Two-spotted Longhorn Bee",Iowa,Cherokee,2023-08-25,17:09:00,Cherokee,42.750239,-95.5635908,"Ginger Murphy",adult,Sighting,Photograph,1,,,,,,,,,"In my flower garden. Looks like a female two-spotted longhorn bee."
344651,,,,"Melissodes bimaculata","Two-spotted Longhorn Bee",Iowa,Sioux,2023-07-02,,"Oak Grove State Park",43.061008,-96.470915,"Jay Gilliam",adult,Sighting,Photograph,1,,,,,,,,,
344755,,,,"Melissodes bimaculata","Two-spotted Longhorn Bee",Iowa,Osceola,2023-07-29,,"Wolter's Prairie Preserve",42.773263,-92.71744,"Jay Gilliam",adult,Sighting,Photograph,1,,,,,,,,,
344764,,,,"Melissodes bimaculata","Two-spotted Longhorn Bee",Iowa,Woodbury,2023-07-30,,"Snyder Bend Park",42.28437,-96.336629,"Jay Gilliam",adult,Sighting,Photograph,1,,,,,,,,,
344773,,,,"Melissodes bimaculata","Two-spotted Longhorn Bee",Iowa,Mills,2023-07-30,,"Folsom Point Preserve",41.154432,-95.799393,"Jay Gilliam",adult,Sighting,Photograph,1,,,,,,,,,
344777,,,,"Melissodes bimaculata","Two-spotted Longhorn Bee",Iowa,Fremont,2023-08-05,,"Riverton Wildlife Managemnet Area",40.706637,-95.576632,"Jay Gilliam",adult,Sighting,Photograph,1,,,,,,,,,
344805,,,,"Melissodes bimaculata","Two-spotted Longhorn Bee",Iowa,Warren,2023-08-11,,Redacted,Redacted,Redacted,"Jay Gilliam",adult,Sighting,Photograph,1,,,,,,,,,
344869,,,,"Melissodes bimaculata","Two-spotted Longhorn Bee",Iowa,Wright,2023-08-26,,"Big Wall Lake Wildlife Management Area",42.626904,-93.651943,"Jay Gilliam",adult,Sighting,Photograph,1,,,,,,,,,
