ID,"Collection / Source","Catalog Number","Specify Number",Taxon,"Common Name",State,County,Date,Time,Locale,Latitude,Longitude,Collector,"Life Stage","Collection Method","Preparation Type",Count,Temperature,Humidity,"Dew Point",Wind,"Wind Direction","Barometric Pressure",Sky,"Moon Phase",Notes
21251,"Jim Durbin Drawer 022",2014-021588,SPM033723,"Xenotemna pallorana",None,Iowa,"Van Buren",2013-05-29,,"Lacey-Keosauqua State Park",40.71688,-91.9908,"Tom Jantscher",adult,,Pinned,1,,,,,,,,,
49011,,2014-049389,SPM008053,"Xenotemna pallorana",None,Iowa,Jasper,2006-05-25,,"Neal Smith National Wildlife Refuge",41.54245,-93.2908,"Keith Summerville",adult,,Pinned,1,,,,,,,,,
49012,,2014-049390,SPM008171,"Xenotemna pallorana",None,Iowa,Jasper,2005-05-25,,"Neal Smith National Wildlife Refuge",41.54245,-93.2908,"Keith Summerville",adult,,Pinned,1,,,,,,,,,
49013,,2014-049391,SPM008243,"Xenotemna pallorana",None,Iowa,Jasper,2004-05-25,,"Neal Smith National Wildlife Refuge",41.54245,-93.2908,"Keith Summerville",adult,,Pinned,1,,,,,,,,,
49014,"Jim Durbin Drawer 022",2014-049392,SPM019093,"Xenotemna pallorana",None,Iowa,Linn,2010-07-08,,"Rock Island Botanical State Preserve",42.02732,-91.72723,"Tom Jantscher",adult,,Pinned,1,,,,,,,,,
49015,,2014-049393,SPM020029,"Xenotemna pallorana",None,Iowa,Winneshiek,2010-07-13,,"100 Acre Wood-x",0,0,"MJ Hatfield",adult,,Pinned,1,,,,,,,,,
49016,,2014-049394,SPM025252,"Xenotemna pallorana",None,Iowa,Polk,2011-05-18,,"Puccoon Prairie",41.73528,-93.36417,"Keith Summerville",adult,,Sighting,1,,,,,,,,,
49017,,2014-049395,SPM025758,"Xenotemna pallorana",None,Iowa,Polk,2011-05-18,,"Chichaqua Bottoms Sandhill Prairie",41.77278,-93.385,"Keith Summerville",adult,,Sighting,1,,,,,,,,,
49018,,2014-049396,SPM037133,"Xenotemna pallorana",None,Iowa,Winneshiek,2010-07-13,,"100 Acre Wood-x",0,0,"MJ Hatfield",adult,,Photograph,1,,,,,,,,,
71749,,2014-072356,,"Xenotemna pallorana",None,Iowa,Polk,2004-05-25,,"Big Creek State Park",41.807055,-93.745185,"Keith Summerville",adult,,Sighting,1,,,,,,,,,
71750,,2014-072357,,"Xenotemna pallorana",None,Iowa,Polk,2005-05-25,,"Big Creek State Park",41.807055,-93.745185,"Keith Summerville",adult,,Sighting,19,,,,,,,,,
71751,,2014-072358,,"Xenotemna pallorana",None,Iowa,Polk,2006-05-25,,"Big Creek State Park",41.807055,-93.745185,"Keith Summerville",adult,,Sighting,35,,,,,,,,,
71752,,2014-072359,,"Xenotemna pallorana",None,Iowa,Polk,2004-05-25,,"Thomas Mitchell Park",41.64,-93.3823,"Keith Summerville",adult,,Sighting,3,,,,,,,,,
71753,,2014-072360,,"Xenotemna pallorana",None,Iowa,Polk,2005-05-25,,"Thomas Mitchell Park",41.64,-93.3823,"Keith Summerville",adult,,Sighting,30,,,,,,,,,
71754,,2014-072361,,"Xenotemna pallorana",None,Iowa,Polk,2006-05-25,,"Thomas Mitchell Park",41.64,-93.3823,"Keith Summerville",adult,,Sighting,16,,,,,,,,,
71755,,2014-072362,,"Xenotemna pallorana",None,Iowa,Polk,2005-05-25,,"Puccoon Prairie",41.73528,-93.36417,"Keith Summerville",adult,,Sighting,25,,,,,,,,,
71756,,2014-072363,,"Xenotemna pallorana",None,Iowa,Polk,2006-05-25,,"Puccoon Prairie",41.73528,-93.36417,"Keith Summerville",adult,,Sighting,3,,,,,,,,,
71757,,2014-072364,,"Xenotemna pallorana",None,Iowa,Polk,2004-05-25,,"Synder Farm INHF",41.76675,-93.484171,"Keith Summerville",adult,,Sighting,1,,,,,,,,,
71758,,2014-072365,,"Xenotemna pallorana",None,Iowa,Polk,2005-05-25,,"Synder Farm INHF",41.76675,-93.484171,"Keith Summerville",adult,,Sighting,24,,,,,,,,,
71759,,2014-072366,,"Xenotemna pallorana",None,Iowa,Polk,2006-05-25,,"Synder Farm INHF",41.76675,-93.484171,"Keith Summerville",adult,,Sighting,7,,,,,,,,,
71760,,2014-072367,,"Xenotemna pallorana",None,Iowa,Polk,2004-05-25,,"Chichaqua Bottoms Sandhill Prairie",41.77278,-93.385,"Keith Summerville",adult,,Sighting,3,,,,,,,,,
71761,,2014-072368,,"Xenotemna pallorana",None,Iowa,Polk,2005-05-25,,"Chichaqua Bottoms Sandhill Prairie",41.77278,-93.385,"Keith Summerville",adult,,Sighting,20,,,,,,,,,
71762,,2014-072369,,"Xenotemna pallorana",None,Iowa,Polk,2006-05-25,,"Chichaqua Bottoms Sandhill Prairie",41.77278,-93.385,"Keith Summerville",adult,,Sighting,14,,,,,,,,,
71763,,2014-072370,,"Xenotemna pallorana",None,Iowa,Polk,2005-05-25,,"Paul Errington Marsh Wildlife Management Area",41.75611,-93.50556,"Keith Summerville",adult,,Sighting,10,,,,,,,,,
71764,,2014-072371,,"Xenotemna pallorana",None,Iowa,Polk,2006-05-25,,"Paul Errington Marsh Wildlife Management Area",41.75611,-93.50556,"Keith Summerville",adult,,Sighting,12,,,,,,,,,
71765,,2014-072372,,"Xenotemna pallorana",None,Iowa,Polk,2005-05-25,,"Glendale Cemetery",41.60889,-93.69167,"Keith Summerville",adult,,Sighting,6,,,,,,,,,
71766,,2014-072373,,"Xenotemna pallorana",None,Iowa,Polk,2006-05-25,,"Glendale Cemetery",41.60889,-93.69167,"Keith Summerville",adult,,Sighting,34,,,,,,,,,
71767,,2014-072374,,"Xenotemna pallorana",None,Iowa,Jasper,2004-05-25,,"Neal Smith National Wildlife Refuge",41.57639,-93.265,"Keith Summerville",adult,,Sighting,8,,,,,,,,,
71768,,2014-072375,,"Xenotemna pallorana",None,Iowa,Jasper,2005-05-25,,"Neal Smith National Wildlife Refuge",41.57639,-93.265,"Keith Summerville",adult,,Sighting,22,,,,,,,,,
71769,,2014-072376,,"Xenotemna pallorana",None,Iowa,Jasper,2006-05-25,,"Neal Smith National Wildlife Refuge",41.57639,-93.265,"Keith Summerville",adult,,Sighting,19,,,,,,,,,
71770,,2014-072377,,"Xenotemna pallorana",None,Iowa,Polk,2004-05-25,,"Big Creek State Park",41.81167,-93.75333,"Keith Summerville",adult,,Sighting,1,,,,,,,,,
71771,,2014-072378,,"Xenotemna pallorana",None,Iowa,Polk,2005-05-25,,"Big Creek State Park",41.81167,-93.75333,"Keith Summerville",adult,,Sighting,33,,,,,,,,,
71772,,2014-072379,,"Xenotemna pallorana",None,Iowa,Polk,2006-05-25,,"Big Creek State Park",41.81167,-93.75333,"Keith Summerville",adult,,Sighting,5,,,,,,,,,
71773,,2014-072380,,"Xenotemna pallorana",None,Iowa,Polk,2005-05-25,,"Yellow Banks Park",41.547615,-93.47527,"Keith Summerville",adult,,Sighting,48,,,,,,,,,
71774,,2014-072381,,"Xenotemna pallorana",None,Iowa,Polk,2006-05-25,,"Yellow Banks Park",41.547615,-93.47527,"Keith Summerville",adult,,Sighting,20,,,,,,,,,
71775,,2014-072382,,"Xenotemna pallorana",None,Iowa,Jasper,2004-05-25,,"Neal Smith National Wildlife Refuge",41.54245,-93.2908,"Keith Summerville",adult,,Sighting,3,,,,,,,,,
71776,,2014-072383,,"Xenotemna pallorana",None,Iowa,Jasper,2005-05-25,,"Neal Smith National Wildlife Refuge",41.54245,-93.2908,"Keith Summerville",adult,,Sighting,24,,,,,,,,,
71777,,2014-072384,,"Xenotemna pallorana",None,Iowa,Jasper,2006-05-25,,"Neal Smith National Wildlife Refuge",41.54245,-93.2908,"Keith Summerville",adult,,Sighting,5,,,,,,,,,
131536,,2015-022127,,"Xenotemna pallorana",None,Iowa,Story,2015-08-01,,"Ames, Paul",42.02064,-93.623952,"Paul Martsching",adult,"Building Light",Sighting,1,,,,,,,,,
131537,"Paul Martsching Collection",2015-022128,,"Xenotemna pallorana",None,Iowa,Story,2015-06-27,,"Ames, Paul",42.02064,-93.623952,"Paul Martsching",adult,"Building Light",Pinned,1,,,,,,,,,
132885,,2015-023479,,"Xenotemna pallorana",None,Iowa,Jefferson,2011-08-30,,"Near Fairfield",41.0503,-92.024,"Moni Hayne",adult,Blacklight/Fluorescent,Photograph,1,,,,,,,,,
133406,"Paul Martsching Collection",2015-024000,,"Xenotemna pallorana",None,Iowa,Story,2008-06-06,,"Ames, Paul",42.02064,-93.623952,"Paul Martsching",adult,"Building Light",Pinned,1,,,,,,,,,
133407,"Paul Martsching Collection",2015-024001,,"Xenotemna pallorana",None,Iowa,Story,2004-08-18,,"Ames, Paul",42.02064,-93.623952,"Paul Martsching",adult,"Building Light",Pinned,1,,,,,,,,,
133408,"Paul Martsching Collection",2015-024002,,"Xenotemna pallorana",None,Iowa,Story,2014-08-17,,"Ames, Paul",42.02064,-93.623952,"Paul Martsching",adult,"Building Light",Pinned,1,,,,,,,,,
133409,"Paul Martsching Collection",2015-024003,,"Xenotemna pallorana",None,Iowa,Story,2014-08-18,,"Ames, Paul",42.02064,-93.623952,"Paul Martsching",adult,"Building Light",Pinned,1,,,,,,,,,
133410,"Paul Martsching Collection",2015-024004,,"Xenotemna pallorana",None,Iowa,Story,2014-08-18,,"Ames, Paul",42.02064,-93.623952,"Paul Martsching",adult,"Building Light",Pinned,1,,,,,,,,,
177514,,2016-042264,,"Xenotemna pallorana",None,Iowa,Story,2016-08-22,,"Ames, Paul",42.02064,-93.623952,"Paul Martsching",adult,"Building Light",Sighting,1,,,,,,,,,"22 Aug 2016 81/63 mostly clear; strong & gusty S wind.  1245-315 am CDST 23 Aug 65 deg; wind S 10 mph; 2/3 lit Moon; cirrus sky."
177515,,2016-042265,,"Xenotemna pallorana",None,Iowa,Story,2016-08-23,,"Ames, Paul",42.02064,-93.623952,"Paul Martsching",adult,"Building Light",Sighting,1,,,,,,,,,"23 Aug 2016 81/70 S/SE 10 - 20 mph; mostly clear.  1245-200 am CDST 24 Aug 75/75 wind S 10 mph; overcast; North only; light rain by 200 am. "
177516,,2016-042266,,"Xenotemna pallorana",None,Iowa,Story,2016-08-24,,"Ames, Paul",42.02064,-93.623952,"Paul Martsching",adult,"Building Light",Sighting,1,,,,,,,,,"24 Aug 2016 81/73 W ~5 mph; overcast.  25 Aug 1245-300 am 65 deg; overcast; N ~6 mph."
177517,,2016-042267,,"Xenotemna pallorana",None,Iowa,Story,2016-09-01,,"Ames, Paul",42.02064,-93.623952,"Paul Martsching",adult,"Building Light",Sighting,1,,,,,,,,,"01 Sep 2016  78/57   E/NE ~7 mph.  1245-245 am CDST 02 Sep 58 deg; calm; clear."
182968,,2017-000929,,"Xenotemna pallorana",None,Iowa,Audubon,2016-06-28,,Redacted,Redacted,Redacted,"MJ Hatfield",adult,,Photograph,1,,,,,,,,,
200511,,2017-018443,,"Xenotemna pallorana",None,Iowa,Pottawattamie,2017-07-29,,"Hitchcock Nature Center",41.41733,-95.85388,"Loren & Babs Padelford",adult,,Photograph,1,,,,,,,,,
200560,,2017-018492,,"Xenotemna pallorana",None,Iowa,Winneshiek,2017-06-05,,"Chipera Prairie Park",43.13052,-92.00603,"John Van Der Linden",adult,,Photograph,1,,,,,,,,,
238865,,,,"Xenotemna pallorana",None,Iowa,Johnson,2019-08-13,,"Sugar Bottom Recreational Area",41.761676,-91.554925,"Mark Brown",adult,"Building Light",Photograph,1,,,,,,,,,
241429,,,,"Xenotemna pallorana",None,Iowa,Johnson,2019-09-26,,Redacted,Redacted,Redacted,"Mark Brown",adult,"Building Light",Photograph,1,,,,,,,,,
241875,,,,"Xenotemna pallorana",None,Iowa,Story,2019-08-04,0330,"Ames, Paul",42.02064,-93.623952,"Paul Martsching",adult,"Building Light",Sighting,1,,,,,,,,,
241876,,,,"Xenotemna pallorana",None,Iowa,Story,2019-08-08,0330,"Ames, Paul",42.02064,-93.623952,"Paul Martsching",adult,"Building Light",Sighting,1,,,,,,,,,
241877,,,,"Xenotemna pallorana",None,Iowa,Story,2019-08-19,0330,"Ames, Paul",42.02064,-93.623952,"Paul Martsching",adult,"Building Light",Sighting,4,,,,,,,,,
241878,,,,"Xenotemna pallorana",None,Iowa,Story,2019-08-20,0330,"Ames, Paul",42.02064,-93.623952,"Paul Martsching",adult,"Building Light",Sighting,7,,,,,,,,,
241879,,,,"Xenotemna pallorana",None,Iowa,Story,2019-08-23,0330,"Ames, Paul",42.02064,-93.623952,"Paul Martsching",adult,"Building Light",Sighting,6,,,,,,,,,
241880,,,,"Xenotemna pallorana",None,Iowa,Story,2019-08-24,0330,"Ames, Paul",42.02064,-93.623952,"Paul Martsching",adult,"Building Light",Sighting,5,,,,,,,,,
241881,,,,"Xenotemna pallorana",None,Iowa,Story,2019-08-25,0330,"Ames, Paul",42.02064,-93.623952,"Paul Martsching",adult,"Building Light",Sighting,1,,,,,,,,,
241882,,,,"Xenotemna pallorana",None,Iowa,Story,2019-08-26,0330,"Ames, Paul",42.02064,-93.623952,"Paul Martsching",adult,"Building Light",Sighting,1,,,,,,,,,
241883,,,,"Xenotemna pallorana",None,Iowa,Story,2019-08-29,0330,"Ames, Paul",42.02064,-93.623952,"Paul Martsching",adult,"Building Light",Sighting,2,,,,,,,,,
241884,,,,"Xenotemna pallorana",None,Iowa,Story,2019-08-30,0330,"Ames, Paul",42.02064,-93.623952,"Paul Martsching",adult,"Building Light",Sighting,3,,,,,,,,,
241885,,,,"Xenotemna pallorana",None,Iowa,Story,2019-08-31,0330,"Ames, Paul",42.02064,-93.623952,"Paul Martsching",adult,"Building Light",Sighting,2,,,,,,,,,
241886,,,,"Xenotemna pallorana",None,Iowa,Story,2019-09-02,0330,"Ames, Paul",42.02064,-93.623952,"Paul Martsching",adult,"Building Light",Sighting,7,,,,,,,,,
241887,,,,"Xenotemna pallorana",None,Iowa,Story,2019-09-03,0330,"Ames, Paul",42.02064,-93.623952,"Paul Martsching",adult,"Building Light",Sighting,3,,,,,,,,,
241888,,,,"Xenotemna pallorana",None,Iowa,Story,2019-09-06,0330,"Ames, Paul",42.02064,-93.623952,"Paul Martsching",adult,"Building Light",Sighting,1,,,,,,,,,
241889,,,,"Xenotemna pallorana",None,Iowa,Story,2019-09-07,0330,"Ames, Paul",42.02064,-93.623952,"Paul Martsching",adult,"Building Light",Sighting,1,,,,,,,,,
278142,,,,"Xenotemna pallorana",None,Iowa,Story,2020-08-09,,"Ames, Paul",42.012366,-93.613528,"Paul Martsching",adult,Sighting,Sighting,1,,,,,,,,,
278143,,,,"Xenotemna pallorana",None,Iowa,Story,2020-08-14,,"Ames, Paul",42.012366,-93.613528,"Paul Martsching",adult,Sighting,Sighting,1,,,,,,,,,
278144,,,,"Xenotemna pallorana",None,Iowa,Story,2020-08-20,,"Ames, Paul",42.012366,-93.613528,"Paul Martsching",adult,Sighting,Sighting,2,,,,,,,,,
278145,,,,"Xenotemna pallorana",None,Iowa,Story,2020-08-22,,"Ames, Paul",42.012366,-93.613528,"Paul Martsching",adult,Sighting,Sighting,3,,,,,,,,,
278146,,,,"Xenotemna pallorana",None,Iowa,Story,2020-08-23,,"Ames, Paul",42.012366,-93.613528,"Paul Martsching",adult,Sighting,Sighting,4,,,,,,,,,
278147,,,,"Xenotemna pallorana",None,Iowa,Story,2020-08-24,,"Ames, Paul",42.012366,-93.613528,"Paul Martsching",adult,Sighting,Sighting,3,,,,,,,,,
278148,,,,"Xenotemna pallorana",None,Iowa,Story,2020-08-25,,"Ames, Paul",42.012366,-93.613528,"Paul Martsching",adult,Sighting,Sighting,1,,,,,,,,,
278149,,,,"Xenotemna pallorana",None,Iowa,Story,2020-08-27,,"Ames, Paul",42.012366,-93.613528,"Paul Martsching",adult,Sighting,Sighting,3,,,,,,,,,
278150,,,,"Xenotemna pallorana",None,Iowa,Story,2020-09-03,,"Ames, Paul",42.012366,-93.613528,"Paul Martsching",adult,Sighting,Sighting,1,,,,,,,,,
308955,"Jim Durbin Drawer 022",2022-000227,,"Xenotemna pallorana",None,Iowa,Howard,2004-08-29,,"Hayden Prairie State Wildlife Management Area",43.441579,-92.38119,"Frank Olsen",adult,Blacklighting,Pinned,1,,,,,,,,,
308956,"Jim Durbin Drawer 022",2022-000228,,"Xenotemna pallorana",None,Iowa,Howard,2004-08-29,,"Hayden Prairie State Wildlife Management Area",43.441579,-92.38119,"Frank Olsen",adult,Blacklighting,Pinned,1,,,,,,,,,
316150,,,,"Xenotemna pallorana",None,Iowa,Johnson,2022-08-28,,"Willow Creek/Kiwanis Park",41.647924,-91.569677,"Peter Hansen",adult,Sighting,Photograph,1,,,,,,,,,
320423,,,,"Xenotemna pallorana",None,Iowa,Johnson,2022-07-11,23:29:09,Redacted,Redacted,Redacted,"Mark Brown",adult,Sighting,Photograph,1,,,,,,,,,
320569,,,,"Xenotemna pallorana",None,Iowa,Johnson,2022-07-18,6:06:23,Redacted,Redacted,Redacted,"Mark Brown",adult,Sighting,Photograph,1,,,,,,,,,
331922,,,,"Xenotemna pallorana",None,Iowa,Johnson,2022-08-20,,Redacted,Redacted,Redacted,"Mark Brown",adult,Sighting,Photograph,1,,,,,,,,,
332825,,,,"Xenotemna pallorana",None,Iowa,Johnson,2022-08-21,09:01:05,"MacBride Nature Recreation Area",41.78690624833333,-91.56850041333334,"Mark Brown",adult,Sighting,Photograph,1,,,,,,,,,
343352,,,,"Xenotemna pallorana",None,Iowa,Johnson,2023-07-01,05:59:11,Redacted,Redacted,Redacted,"Mark Brown",adult,Sighting,Photograph,1,,,,,,,,,
